program: Orca
programVersion: 5.0.4
elementType: N C C C C C C Se N C C C C C C C C C C C C H H H H H H H H H H H H H H H H
charge: 2
multiplicity: 1
keywords: Opt RIJCOSX PBEh-3c
formula: C18H16N2Se
InChI: InChI=1/C18H16N2Se/c1-4-10-16(11-5-1)19-21-20(17-12-6-2-7-13-17)18-14-8-3-9-15-18/h1-15,19H
37 atoms
N  1.484279 -0.021019 2.294407
C  2.018975 -0.454713 1.092433
C  2.355006 -1.811208 0.954971
C  2.953301 -2.249602 -0.206202
C  3.22439 -1.350732 -1.237091
C  2.89456 -0.002531 -1.102185
C  2.289392 0.451794 0.049071
Se 0.074979 1.077131 2.453713
N  -0.871019 0.685695 0.953434
C  -0.870706 -0.600544 0.446564
C  -0.575896 -0.794903 -0.920038
C  -0.588621 -2.07232 -1.437863
C  -0.895953 -3.150929 -0.614361
C  -1.183826 -2.96067 0.743936
C  -1.159594 -1.698813 1.283872
C  -1.370933 1.746556 0.200323
C  -0.745942 3.008307 0.171403
C  -1.345511 4.041983 -0.513466
C  -2.548608 3.834489 -1.187085
C  -3.158606 2.578803 -1.176413
C  -2.583153 1.534457 -0.492641
H  1.59332 -0.662932 3.076673
H  2.156841 -2.508695 1.759798
H  3.229146 -3.290048 -0.307866
H  3.71797 -1.695822 -2.135634
H  3.146166 0.696583 -1.887651
H  2.109781 1.512271 0.178777
H  -0.318659 0.048228 -1.546691
H  -0.364277 -2.232563 -2.482979
H  -0.925021 -4.150349 -1.028408
H  -1.457118 -3.806081 1.360187
H  -1.445831 -1.543655 2.317578
H  0.225725 3.170183 0.62074
H  -0.861878 5.007925 -0.554666
H  -3.008616 4.651156 -1.727187
H  -4.102223 2.43109 -1.682954
H  -3.09204 0.58168 -0.4253
totalener: -3203.06858618 hartree
nucrepener: 2133.59902693 hartree
electener: -5336.66761311 hartree
oneelecener: -8626.09138554 hartree
twoeener: 3289.42377243 hartree
kineticenergy: 3195.13568092 hartree
exchangeener: -110.657937913851 hartree
correlationener: -8.084700830367 hartree
xcener: -118.742638744218 hartree
dispersion: -0.032588800 hartree
dispersion: -0.032892699 hartree
dispersion: -0.032828643 hartree
dispersion: -0.032733969 hartree
dispersion: -0.032458326 hartree
dispersion: -0.032928970 hartree
dispersion: -0.032669183 hartree
dispersion: -0.032694865 hartree
dispersion: -0.032725316 hartree
chargesum: 2.0000000
charge: -0.791969 0.362770 -0.255463 -0.210188 -0.197444 -0.214368 -0.259910 0.823582 -0.682970 0.270225 -0.199519 -0.211024 -0.178602 -0.211237 -0.255427 0.326336 -0.281524 -0.198469 -0.180745 -0.201517 -0.225655 0.436035 0.280279 0.300222 0.306895 0.297317 0.280875 0.308482 0.305147 0.317586 0.311710 0.304189 0.280940 0.308129 0.317209 0.309262 0.308841
charge: -0.262713 0.004546 -0.112742 -0.093832 -0.052275 -0.100820 -0.118074 0.692410 -0.051778 -0.002773 -0.073266 -0.104275 -0.020059 -0.093093 -0.102224 0.010030 -0.125993 -0.088862 -0.025681 -0.088494 -0.093165 0.296976 0.163306 0.174141 0.176239 0.172352 0.157029 0.175521 0.177121 0.181502 0.179573 0.170950 0.161926 0.178908 0.182281 0.180139 0.175169
qa: -0.7920 0.3628 -0.2555 -0.2102 -0.1974 -0.2144 -0.2599 0.8236 -0.6830 0.2702 -0.1995 -0.2110 -0.1786 -0.2112 -0.2554 0.3263 -0.2815 -0.1985 -0.1807 -0.2015 -0.2257 0.4360 0.2803 0.3002 0.3069 0.2973 0.2809 0.3085 0.3051 0.3176 0.3117 0.3042 0.2809 0.3081 0.3172 0.3093 0.3088
va: 2.9629 3.5102 3.7779 3.7940 3.7432 3.8003 3.7784 2.5672 3.1547 3.5893 3.7339 3.7761 3.7201 3.7711 3.7683 3.5265 3.7823 3.7858 3.7236 3.7772 3.7431 0.7871 0.8893 0.8789 0.8750 0.8808 0.8863 0.8775 0.8774 0.8691 0.8737 0.8745 0.8878 0.8752 0.8695 0.8749 0.8710
dispersion: -0.032730737 hartree
energy: -3203.042164638546 hartree
dipole: -0.19643 -0.14562 -0.34206 -14.05725 13.29350 -0.76376 -32.02817 31.07547 -0.95270
magnitude: 1.26805 au
magnitude: 3.22314 debye
