program: Orca
programVersion: 5.0.4
elementType: N C C C C C C C C C C C C Se N C C C C C C C C C C C C H H H H H H H H H H H H H H H H H H H H
charge: 2
multiplicity: 1
keywords: Freq RIJCOSX PBEh-3c
frequency: 0.00 0.00 0.00 0.00 0.00 0.00 23.07 35.26 52.63 56.46 65.95 67.38 74.89 93.86 95.11 107.61 142.97 162.25 173.22 242.20 251.54 263.36 268.60 312.05 313.32 344.64 349.00 418.08 418.69 422.31 425.86 454.85 466.35 506.82 511.65 554.00 559.13 608.19 624.00 626.69 627.15 635.58 637.65 698.09 699.37 705.95 706.78 714.14 716.27 804.94 806.14 807.85 811.21 859.10 863.50 872.59 876.65 928.24 938.02 956.35 962.52 979.74 982.48 996.87 997.19 1031.70 1033.03 1036.44 1038.29 1040.93 1041.20 1043.22 1044.73 1067.60 1067.81 1068.71 1069.41 1076.93 1077.38 1079.49 1079.74 1155.89 1156.54 1163.12 1164.47 1223.82 1230.15 1230.18 1232.01 1232.58 1237.63 1245.00 1247.76 1269.79 1276.54 1345.66 1349.31 1382.25 1385.12 1391.65 1393.74 1419.68 1423.60 1424.16 1425.93 1533.48 1534.32 1540.50 1541.42 1551.06 1552.03 1557.93 1559.49 1657.96 1658.78 1666.60 1666.94 1680.82 1682.85 1688.74 1700.16 3267.27 3268.14 3271.23 3272.99 3285.86 3285.97 3286.45 3286.64 3291.81 3292.06 3294.67 3294.85 3300.36 3300.54 3302.52 3302.66 3306.87 3307.01 3309.16 3309.25
frequency: 23.07 35.26 52.63 56.46 65.95 67.38 74.89 93.86 95.11 107.61 142.97 162.25 173.22 242.20 251.54 263.36 268.60 312.05 313.32 344.64 349.00 418.08 418.69 422.31 425.86 454.85 466.35 506.82 511.65 554.00 559.13 608.19 624.00 626.69 627.15 635.58 637.65 698.09 699.37 705.95 706.78 714.14 716.27 804.94 806.14 807.85 811.21 859.10 863.50 872.59 876.65 928.24 938.02 956.35 962.52 979.74 982.48 996.87 997.19 1031.70 1033.03 1036.44 1038.29 1040.93 1041.20 1043.22 1044.73 1067.60 1067.81 1068.71 1069.41 1076.93 1077.38 1079.49 1079.74 1155.89 1156.54 1163.12 1164.47 1223.82 1230.15 1230.18 1232.01 1232.58 1237.63 1245.00 1247.76 1269.79 1276.54 1345.66 1349.31 1382.25 1385.12 1391.65 1393.74 1419.68 1423.60 1424.16 1425.93 1533.48 1534.32 1540.50 1541.42 1551.06 1552.03 1557.93 1559.49 1657.96 1658.78 1666.60 1666.94 1680.82 1682.85 1688.74 1700.16 3267.27 3268.14 3271.23 3272.99 3285.86 3285.97 3286.45 3286.64 3291.81 3292.06 3294.67 3294.85 3300.36 3300.54 3302.52 3302.66 3306.87 3307.01 3309.16 3309.25
formula: C24H20N2Se
InChI: InChI=1/C24H20N2Se/c1-5-13-21(14-6-1)25(22-15-7-2-8-16-22)27-26(23-17-9-3-10-18-23)24-19-11-4-12-20-24/h1-20H
47 atoms
N  -1.329875 -0.296232 0.900591
C  -2.21266 0.349448 1.781984
C  -3.586228 0.280705 1.494794
C  -4.485331 0.834995 2.377655
C  -4.037214 1.458379 3.542835
C  -2.677485 1.537261 3.818599
C  -1.757797 0.996579 2.940568
C  -1.462897 -0.159293 -0.483998
C  -1.329963 -1.271589 -1.326859
C  -1.499193 -1.10919 -2.684866
C  -1.787377 0.151099 -3.210377
C  -1.909269 1.253653 -2.373384
C  -1.745022 1.109982 -1.009445
Se 0.07663 -1.125144 1.635274
N  1.393549 -0.676378 0.509031
C  2.308367 -1.685927 0.170177
C  1.913524 -3.025323 0.032149
C  2.871002 -3.992036 -0.206247
C  4.208275 -3.635306 -0.332507
C  4.594454 -2.298963 -0.2218
C  3.658202 -1.321887 0.029196
C  1.425511 0.568674 -0.126193
C  1.614182 0.608493 -1.515031
C  1.681972 1.832869 -2.150988
C  1.554716 3.006971 -1.418791
C  1.355939 2.963388 -0.038125
C  1.286471 1.751008 0.613891
H  -3.935035 -0.243439 0.614849
H  -5.544937 0.765106 2.174762
H  -4.751664 1.889781 4.230524
H  -2.33313 2.046671 4.707631
H  -0.70161 1.131753 3.136367
H  -1.178797 -2.262247 -0.915392
H  -1.444189 -1.967819 -3.339762
H  -1.931576 0.265541 -4.276286
H  -2.134589 2.226874 -2.786472
H  -1.822074 1.967038 -0.3533
H  0.870157 -3.314414 0.051843
H  2.571236 -5.023991 -0.322758
H  4.952113 -4.395893 -0.526709
H  5.637492 -2.02843 -0.309277
H  3.965123 -0.292978 0.163506
H  1.696653 -0.310238 -2.080746
H  1.836693 1.87356 -3.220089
H  1.62414 3.963621 -1.918867
H  1.292897 3.882331 0.528156
H  1.208513 1.720736 1.693884
totalener: -3433.63584919 hartree
nucrepener: 3027.21298340 hartree
electener: -6460.84883259 hartree
twoeener: 4251.80420015 hartree
kineticenergy: 3423.86676732 hartree
exchangeener: -128.815174415730 hartree
correlationener: -9.835869826112 hartree
xcener: -138.651044241842 hartree
chargesum: 2.0000000
charge: -0.728968 0.318381 -0.225912 -0.205807 -0.189681 -0.205635 -0.279025 0.285648 -0.262311 -0.219944 -0.195687 -0.213651 -0.210196 0.845246 -0.728719 0.319520 -0.280356 -0.204825 -0.190594 -0.205011 -0.226472 0.283981 -0.210100 -0.213817 -0.195566 -0.219711 -0.261918 0.295186 0.298141 0.303178 0.293712 0.263687 0.274581 0.294852 0.300907 0.292080 0.293215 0.264387 0.294099 0.303520 0.298122 0.295790 0.293241 0.292200 0.300842 0.294670 0.274718
charge: -0.091836 0.000857 -0.104498 -0.088893 -0.050553 -0.097660 -0.136507 -0.009684 -0.122699 -0.099677 -0.057732 -0.103246 -0.092212 0.731486 -0.091420 0.001443 -0.136776 -0.097283 -0.050359 -0.088891 -0.104551 -0.010063 -0.092270 -0.103297 -0.057776 -0.099605 -0.122561 0.170640 0.174342 0.175663 0.171889 0.152839 0.156789 0.171327 0.173611 0.170497 0.170104 0.153319 0.172024 0.175811 0.174361 0.170796 0.170110 0.170528 0.173619 0.171290 0.156707
qa: -0.7290 0.3184 -0.2259 -0.2058 -0.1897 -0.2056 -0.2790 0.2856 -0.2623 -0.2199 -0.1957 -0.2137 -0.2102 0.8452 -0.7287 0.3195 -0.2804 -0.2048 -0.1906 -0.2050 -0.2265 0.2840 -0.2101 -0.2138 -0.1956 -0.2197 -0.2619 0.2952 0.2981 0.3032 0.2937 0.2637 0.2746 0.2949 0.3009 0.2921 0.2932 0.2644 0.2941 0.3035 0.2981 0.2958 0.2932 0.2922 0.3008 0.2947 0.2747
va: 3.0898 3.5358 3.7546 3.7859 3.7452 3.8032 3.7829 3.5764 3.7821 3.7948 3.7485 3.7889 3.7526 2.6553 3.0907 3.5360 3.7829 3.8029 3.7457 3.7864 3.7538 3.5774 3.7521 3.7886 3.7485 3.7943 3.7819 0.8796 0.8802 0.8768 0.8825 0.8955 0.8902 0.8822 0.8780 0.8835 0.8850 0.8951 0.8822 0.8766 0.8801 0.8791 0.8850 0.8834 0.8780 0.8823 0.8902
dispersion: -0.043162710 hartree
energy: -3433.606904264290 hartree
dipole: -1.03793 1.01638 -0.02155 15.35035 -14.89207 0.45828 -22.30526 21.62533 -0.67993
magnitude: 0.82024 au
magnitude: 2.08488 debye
temp: 298.15 k
press: 1.00 atm
zeropoint: 0.38771907 hartree
thermalvibcorrection: 0.01905318 hartree
thermalrotcorrection: 0.00141627 hartree
thermaltrasncorrection: 0.00141627 hartree
thermaltotal: -3433.19729947 hartree
thermalcorr: 0.02188572 hartree
nonthermalcorr: 0.38771907 hartree
totalcorr: 0.40960479 hartree
thermalcorrenthalpy: 0.00094421 hartree
totalenthalpy: -3433.19635526 hartree
vibrat: 0.03348853 hartree
rotat: 0.01685383 hartree
transl: 0.02088811 hartree
total: 0.07123047 hartree
totalentropycorr: -0.07123047 hartree
gibbsenthalpy: -3433.26758573 hartree
gibbsminuselec: 0.33931854 hartree
