program: Orca
programVersion: 5.0.4
elementType: N Se F F N C C C C H H H H H H
charge: 0
multiplicity: 1
keywords: Freq RIJCOSX PBEh-3c
frequency: 0.00 0.00 0.00 0.00 0.00 0.00 53.14 98.35 178.03 232.83 275.87 330.12 347.42 365.37 390.84 412.69 537.01 591.71 615.36 638.80 641.33 727.57 759.68 773.89 893.59 901.89 933.23 970.08 1091.12 1109.52 1132.72 1141.17 1247.53 1317.86 1395.93 1501.03 1551.65 1627.57 1646.24 3330.78 3343.40 3369.89 3381.41 3624.68 3753.40
frequency: 53.14 98.35 178.03 232.83 275.87 330.12 347.42 365.37 390.84 412.69 537.01 591.71 615.36 638.80 641.33 727.57 759.68 773.89 893.59 901.89 933.23 970.08 1091.12 1109.52 1132.72 1141.17 1247.53 1317.86 1395.93 1501.03 1551.65 1627.57 1646.24 3330.78 3343.40 3369.89 3381.41 3624.68 3753.40
formula: C4H6F2N2Se
InChI: InChI=1/C4H6F2N2Se/c5-9(6,7)8-3-1-2-4-8/h1-4H,7H2
15 atoms
N  -2.460264 -0.70552 0.279661
Se -1.637644 0.791833 -0.258911
F  -1.660729 0.039262 -1.898956
F  -1.581148 1.248455 1.489408
N  0.125123 0.329678 -0.114597
C  1.060427 1.063155 0.585742
C  2.269469 0.465235 0.40492
C  2.067674 -0.671968 -0.424031
C  0.744665 -0.72714 -0.740129
H  -2.885081 -0.626967 1.193097
H  -3.052471 -1.126057 -0.421854
H  0.793573 1.933384 1.158935
H  3.201206 0.800143 0.830358
H  2.815375 -1.377397 -0.747643
H  0.199624 -1.436195 -1.3361
totalener: -2864.68542982 hartree
nucrepener: 829.05625223 hartree
electener: -3693.74168206 hartree
oneelecener: -5629.55146102 hartree
twoeener: 1935.80977896 hartree
kineticenergy: 2859.79642122 hartree
exchangeener: -79.848575154354 hartree
correlationener: -4.940406024195 hartree
xcener: -84.788981178549 hartree
energy: -12399.5542 -1602.4896 -1437.6929 -1437.6396 -1437.5970 -681.9023 -681.8113 -400.1366 -399.3450 -284.8367 -284.7866 -283.7862 -283.7716 -225.2351 -167.7774 -167.6978 -167.5363 -65.9314 -65.8378 -65.6976 -65.6685 -65.6049 -34.8392 -34.4576 -29.7849 -27.6469 -24.1702 -22.2167 -21.4249 -17.6720 -17.1644 -16.8271 -16.7794 -15.3440 -15.1450 -13.7625 -13.2905 -13.1971 -12.5621 -12.4989 -12.1577 -12.0631 -11.9665 -11.7508 -10.7492 -9.2918 -8.0337 -7.0221 0.0454 1.2851 1.7242 2.3454 3.1021 3.8981 4.8361 5.0253 6.0077 6.1851 6.3913 6.9118 7.2094 9.0352 9.8389 11.0300 11.7340 12.3996 12.9238 13.2704 13.8222 14.8063 15.3639 15.8066 15.8727 16.6517 16.8804 17.5303 18.2531 18.4727 18.6183 19.2552 20.8149 22.2829 22.9298 23.0917 23.3038 24.6659 24.8196 25.2559 25.6824 26.3201 26.5121 26.9806 27.1908 28.1424 28.4521 28.7252 30.4458 31.2829 33.0116 33.4392 34.2954 34.6361 34.6936 34.8623 35.0827 35.2793 36.1572 36.5357 37.0806 37.6989 38.7156 39.1769 40.0265 40.2063 40.4701 40.8885 41.8105 43.4372 43.6707 44.7906 45.0474 45.7128 47.0250 48.2289 50.1481 51.0447 52.4801 54.4400 56.4057 57.0501 57.8317 59.3016 60.2058 61.7136 62.3887 62.9439 63.6915 63.8028 65.0129 65.2558 66.2101 69.6943 71.4500 71.5871 73.5071 75.4213 78.1420 79.0746 82.2634 82.8739 84.9790 90.5367 91.7670 94.2775 94.9665 97.5034 364.5316 373.0440 381.6118 390.2915 519.1305 525.9112 886.1072 894.1885 electronvolt
chargesum: -0.0000000
charge: -0.899929 1.451045 -0.504207 -0.507396 -0.625351 -0.015075 -0.306607 -0.307355 0.003152 0.381003 0.377793 0.261450 0.215599 0.215188 0.260689
charge: -0.540804 1.034519 -0.410351 -0.415233 -0.144464 -0.115981 -0.189731 -0.189176 -0.107113 0.256438 0.255094 0.145055 0.137692 0.137539 0.146516
qa: -0.8999 1.4510 -0.5042 -0.5074 -0.6254 -0.0151 -0.3066 -0.3074 0.0032 0.3810 0.3778 0.2615 0.2156 0.2152 0.2607
va: 2.7672 3.4289 0.8410 0.8351 3.2267 3.6740 3.8691 3.8653 3.6766 0.8407 0.8418 0.9005 0.9226 0.9227 0.9025
dispersion: -0.008385683 hartree
energy: -2864.651142111135 hartree
dipole: 15.98639 -16.93838 -0.95199 -8.40180 8.23132 -0.17048 2.78690 -2.69238 0.09452
magnitude: 0.97174 au
magnitude: 2.46997 debye
temp: 298.15 k
press: 1.00 atm
zeropoint: 0.10760857 hartree
thermalvibcorrection: 0.00624186 hartree
thermalrotcorrection: 0.00141627 hartree
thermaltrasncorrection: 0.00141627 hartree
thermaltotal: -2864.53445914 hartree
thermalcorr: 0.00907440 hartree
nonthermalcorr: 0.10760857 hartree
totalcorr: 0.11668297 hartree
thermalcorrenthalpy: 0.00094421 hartree
totalenthalpy: -2864.53351493 hartree
vibrat: 0.01036295 hartree
rotat: 0.01404714 hartree
transl: 0.01984627 hartree
total: 0.04425636 hartree
totalentropycorr: -0.04425636 hartree
gibbsenthalpy: -2864.57777129 hartree
gibbsminuselec: 0.07337082 hartree
