program: Orca
programVersion: 5.0.4
elementType: N Se F F N C C C C H H H H H H
charge: 0
multiplicity: 1
keywords: Opt RIJCOSX PBEh-3c
formula: C4H6F2N2Se
InChI: InChI=1/C4H6F2N2Se/c5-9(6,7)8-3-1-2-4-8/h1-4H,7H2
15 atoms
N  -2.460264 -0.70552 0.279661
Se -1.637644 0.791833 -0.258911
F  -1.660729 0.039262 -1.898956
F  -1.581148 1.248455 1.489408
N  0.125124 0.329678 -0.114597
C  1.060427 1.063155 0.585742
C  2.269469 0.465235 0.40492
C  2.067674 -0.671968 -0.424031
C  0.744665 -0.72714 -0.740129
H  -2.885081 -0.626967 1.193097
H  -3.052471 -1.126057 -0.421854
H  0.793573 1.933384 1.158935
H  3.201206 0.800143 0.830358
H  2.815375 -1.377397 -0.747643
H  0.199624 -1.436195 -1.3361
totalener: -2864.68543990 hartree
nucrepener: 829.06841979 hartree
electener: -3693.75385969 hartree
oneelecener: -5629.57473445 hartree
twoeener: 1935.82087476 hartree
kineticenergy: 2859.79592680 hartree
exchangeener: -79.848562955889 hartree
correlationener: -4.940409506318 hartree
xcener: -84.788972462207 hartree
dispersion: -0.008385803 hartree
energy: -12399.5553 -1602.4906 -1437.6939 -1437.6406 -1437.5980 -681.9030 -681.8119 -400.1369 -399.3448 -284.8367 -284.7866 -283.7863 -283.7716 -225.2357 -167.7780 -167.6984 -167.5369 -65.9320 -65.8383 -65.6981 -65.6690 -65.6054 -34.8395 -34.4579 -29.7850 -27.6468 -24.1703 -22.2167 -21.4250 -17.6721 -17.1645 -16.8271 -16.7794 -15.3441 -15.1451 -13.7626 -13.2906 -13.1972 -12.5623 -12.4991 -12.1579 -12.0633 -11.9666 -11.7509 -10.7494 -9.2918 -8.0338 -7.0222 0.0453 1.2850 1.7241 2.3453 3.1021 3.8981 4.8361 5.0252 6.0076 6.1851 6.3913 6.9117 7.2093 9.0351 9.8388 11.0299 11.7339 12.3995 12.9237 13.2703 13.8221 14.8062 15.3639 15.8066 15.8726 16.6517 16.8804 17.5303 18.2531 18.4726 18.6182 19.2552 20.8149 22.2828 22.9298 23.0917 23.3038 24.6659 24.8196 25.2559 25.6824 26.3201 26.5121 26.9806 27.1908 28.1424 28.4521 28.7252 30.4457 31.2829 33.0115 33.4391 34.2953 34.6360 34.6934 34.8622 35.0826 35.2792 36.1571 36.5356 37.0806 37.6989 38.7155 39.1769 40.0264 40.2063 40.4700 40.8884 41.8104 43.4371 43.6707 44.7905 45.0473 45.7127 47.0249 48.2289 50.1480 51.0446 52.4800 54.4400 56.4057 57.0501 57.8316 59.3015 60.2059 61.7135 62.3887 62.9438 63.6914 63.8027 65.0129 65.2557 66.2100 69.6942 71.4499 71.5871 73.5071 75.4212 78.1420 79.0744 82.2634 82.8738 84.9789 90.5364 91.7667 94.2772 94.9663 97.5032 364.5316 373.0439 381.6117 390.2914 519.1306 525.9110 886.1067 894.1880 electronvolt
chargesum: -0.0000000
charge: -0.899941 1.451048 -0.504201 -0.507390 -0.625343 -0.015077 -0.306600 -0.307353 0.003144 0.381002 0.377794 0.261447 0.215597 0.215185 0.260688
charge: -0.540815 1.034519 -0.410344 -0.415228 -0.144458 -0.115981 -0.189728 -0.189175 -0.107118 0.256438 0.255094 0.145053 0.137690 0.137537 0.146515
qa: -0.8999 1.4510 -0.5042 -0.5074 -0.6253 -0.0151 -0.3066 -0.3074 0.0031 0.3810 0.3778 0.2614 0.2156 0.2152 0.2607
va: 2.7672 3.4289 0.8410 0.8351 3.2267 3.6740 3.8691 3.8653 3.6766 0.8407 0.8418 0.9005 0.9226 0.9227 0.9025
dispersion: -0.008385683 hartree
energy: -2864.651142049527 hartree
dipole: 15.98639 -16.93838 -0.95199 -8.40180 8.23135 -0.17046 2.78690 -2.69239 0.09451
magnitude: 0.97174 au
magnitude: 2.46996 debye
