program: Orca
programVersion: 5.0.4
elementType: N Se F F N C C C C H H H H H H
charge: 0
multiplicity: 1
keywords: SP DSD-BLYP D3BJ def2-QZVPP def2-QZVPP/C def2/J TightSCF
formula: C4H6F2N2Se
InChI: InChI=1/C4H6F2N2Se/c5-9(6,7)8-3-1-2-4-8/h1-4H,7H2
15 atoms
N  -1.712989 -1.114584 0.416875
Se -0.890368 0.382769 -0.121696
F  -0.913453 -0.369802 -1.761741
F  -0.833873 0.839391 1.626623
N  0.872399 -0.079386 0.022617
C  1.807702 0.654091 0.722957
C  3.016744 0.056171 0.542134
C  2.81495 -1.081032 -0.286817
C  1.491941 -1.136204 -0.602914
H  -2.137805 -1.036031 1.330312
H  -2.305195 -1.535121 -0.28464
H  1.540849 1.52432 1.29615
H  3.948481 0.391079 0.967573
H  3.562651 -1.786461 -0.610429
H  0.9469 -1.845259 -1.198886
totalener: -2864.91368674 hartree
nucrepener: 829.05625275 hartree
electener: -3693.96993949 hartree
oneelecener: -5629.53952697 hartree
twoeener: 1935.56958748 hartree
kineticenergy: 2862.20709217 hartree
exchangeener: -44.070860521854 hartree
correlationener: -2.077943899364 hartree
xcener: -46.148804421218 hartree
chargesum: 0.0000000
charge: -0.517765 1.310759 -0.532849 -0.538676 -0.258456 0.000656 -0.129504 -0.123771 0.007795 0.202543 0.203337 0.106629 0.085019 0.083616 0.100668
charge: 0.402515 0.724169 -0.201291 -0.206673 0.199640 -0.094627 0.024072 0.024741 -0.086800 -0.231692 -0.232510 -0.084674 -0.076462 -0.076605 -0.083804
qa: -0.5178 1.3108 -0.5328 -0.5387 -0.2585 0.0007 -0.1295 -0.1238 0.0078 0.2025 0.2033 0.1066 0.0850 0.0836 0.1007
va: 3.0048 3.4708 0.6958 0.6854 3.2226 3.7833 3.8195 3.8032 3.7970 1.0184 1.0099 1.0071 1.0081 1.0086 1.0220
total: -2866.018619152 hartree
dispersion: -0.011793543 hartree
energy: -2866.030412694732 hartree
dipole: 15.98639 -16.76080 -0.77441 -8.40180 8.19974 -0.20206 2.78690 -2.68585 0.10105
magnitude: 0.80669 au
magnitude: 2.05045 debye
