program: Orca
programVersion: 5.0.4
elementType: N Se N C C C C O H H H H H H
charge: 0
multiplicity: 1
keywords: SP DSD-BLYP D3BJ def2-QZVPP def2-QZVPP/C def2/J TightSCF
formula: C4H6N2OSe
InChI: InChI=1/C4H6N2OSe/c5-8(7)6-3-1-2-4-6/h1-4H,5H2
14 atoms
N  1.646849 -1.01542 0.801986
Se 0.935988 -0.017328 -0.548233
N  -0.742722 -0.075184 0.242438
C  -1.437842 -1.207044 0.59245
C  -2.714413 -0.831293 0.896677
C  -2.804767 0.572742 0.7007
C  -1.580605 1.010914 0.285479
O  1.321602 1.529908 -0.385352
H  1.648167 -0.539063 1.69916
H  2.578386 -1.349552 0.582196
H  -0.959013 -2.170842 0.633467
H  -3.497538 -1.488034 1.239168
H  -3.66993 1.194658 0.862652
H  -1.230718 1.998959 0.0380
totalener: -2740.59405028 hartree
nucrepener: 648.97653092 hartree
electener: -3389.57058121 hartree
oneelecener: -5094.76103710 hartree
twoeener: 1705.19045590 hartree
kineticenergy: 2738.05531685 hartree
exchangeener: -40.348378471464 hartree
correlationener: -1.861768555378 hartree
xcener: -42.210147026842 hartree
chargesum: -0.0000000
charge: -0.542144 1.058997 -0.314848 -0.025686 -0.128201 -0.130037 -0.042345 -0.672659 0.210465 0.164840 0.108809 0.081027 0.085753 0.146028
charge: 0.352623 0.766685 0.185495 -0.111629 0.020880 0.019566 -0.098839 -0.335901 -0.227500 -0.246137 -0.088212 -0.077731 -0.078248 -0.081052
qa: -0.5421 1.0590 -0.3148 -0.0257 -0.1282 -0.1300 -0.0423 -0.6727 0.2105 0.1648 0.1088 0.0810 0.0858 0.1460
va: 2.9378 3.6372 3.1913 3.7872 3.8350 3.8294 3.7951 1.7881 1.0167 1.0385 1.0091 1.0094 1.0091 0.9879
total: -2741.551993715 hartree
dispersion: -0.011220858 hartree
energy: -2741.563214573655 hartree
dipole: -14.41786 14.91057 0.49270 -2.01350 0.85565 -1.15785 10.38212 -10.24750 0.13462
magnitude: 1.26550 au
magnitude: 3.21664 debye
