program: Orca
programVersion: 5.0.4
elementType: N Se N C C C C H H H H H H
charge: 2
multiplicity: 1
keywords: Freq RIJCOSX PBEh-3c
frequency: 0.00 0.00 0.00 0.00 0.00 0.00 91.92 125.46 189.63 195.23 323.17 406.86 477.14 528.57 578.39 764.79 815.05 845.72 861.76 877.25 949.58 987.53 1002.18 1035.23 1071.30 1148.16 1185.00 1318.44 1349.65 1428.72 1529.38 1632.61 1655.65 3305.34 3309.66 3333.30 3339.30 3483.84 3603.07
frequency: 91.92 125.46 189.63 195.23 323.17 406.86 477.14 528.57 578.39 764.79 815.05 845.72 861.76 877.25 949.58 987.53 1002.18 1035.23 1071.30 1148.16 1185.00 1318.44 1349.65 1428.72 1529.38 1632.61 1655.65 3305.34 3309.66 3333.30 3339.30 3483.84 3603.07
formula: C4H6N2Se
InChI: InChI=1/C4H6N2Se/c5-7-6-3-1-2-4-6/h1-4H,5H2
13 atoms
N  2.76704 0.07144 -0.666333
Se 1.610859 1.318174 -0.374916
N  0.092257 0.41427 -0.409668
C  -0.225607 -0.859083 -0.6105
C  -1.589443 -0.99351 -0.280951
C  -2.095477 0.257905 0.193642
C  -1.098441 1.145667 0.109224
H  3.668532 0.333536 -1.073938
H  2.747513 -0.847541 -0.220526
H  0.450113 -1.60844 -0.9956
H  -2.160215 -1.905313 -0.412784
H  -3.107347 0.460307 0.513275
H  -1.059584 2.212488 0.292073
totalener: -2664.57830758 hartree
nucrepener: 511.90052556 hartree
electener: -3176.47883315 hartree
oneelecener: -4685.13100009 hartree
twoeener: 1508.65216695 hartree
kineticenergy: 2660.95259981 hartree
exchangeener: -68.168620766043 hartree
correlationener: -3.977642412552 hartree
xcener: -72.146263178595 hartree
energy: -12409.3531 -1612.5196 -1447.6997 -1447.6567 -1447.6424 -412.3791 -410.4279 -296.3183 -296.0865 -295.9799 -294.3953 -235.2560 -177.8156 -177.6717 -177.6101 -75.9005 -75.8660 -75.7795 -75.6554 -75.6455 -41.4326 -38.6478 -35.2831 -33.4635 -31.7899 -28.5836 -28.0064 -27.5274 -26.5169 -24.9034 -24.4547 -23.8462 -23.4095 -22.7244 -22.6144 -21.3302 -19.2372 -17.7270 -14.7118 -10.5383 -9.4513 -9.0259 -7.4030 -5.9385 -5.5658 -4.5275 -4.4013 -3.4170 -3.2485 -2.9974 -2.5096 -1.7148 -0.5144 -0.0427 1.2940 1.8829 2.3574 3.2536 3.5285 4.1942 4.9879 5.3886 5.6777 6.0516 6.2632 6.8758 7.6788 7.9882 8.1694 8.7514 9.9333 11.0053 12.2213 12.8495 13.8746 14.6913 14.9137 15.2629 15.9817 16.4381 16.9007 16.9985 17.8962 18.2847 18.6359 19.9501 21.1940 22.0801 25.6364 26.5423 26.6995 27.8506 28.2196 28.8982 29.8917 32.1679 32.9230 34.1989 36.1868 38.7706 40.1500 41.5672 44.1396 44.7203 45.3331 47.5738 48.3984 49.0914 50.5042 51.4376 51.9313 52.2788 53.7045 54.1502 55.3278 59.2561 59.5715 62.0837 63.0582 65.6225 69.2897 70.8408 73.2728 75.2401 75.3797 78.7193 80.8776 82.6018 352.7431 361.1552 369.4055 378.2373 505.8640 512.2171 electronvolt
chargesum: 2.0000000
charge: -0.847776 1.162495 -0.567156 0.076015 -0.159604 -0.198616 0.046911 0.497769 0.477474 0.371138 0.385912 0.365633 0.389805
charge: -0.421992 0.971953 -0.067553 -0.047336 0.111485 -0.092332 0.046776 0.333490 0.317102 0.200040 0.220888 0.219692 0.207787
qa: -0.8478 1.1625 -0.5672 0.0760 -0.1596 -0.1986 0.0469 0.4978 0.4775 0.3711 0.3859 0.3656 0.3898
va: 2.9552 2.8786 3.3008 3.4881 3.6271 3.7513 3.4913 0.7399 0.7598 0.8390 0.8375 0.8501 0.8214
dispersion: -0.006892042 hartree
energy: -2664.561024828069 hartree
dipole: -12.94475 12.54984 -0.39491 -11.82464 10.44728 -1.37736 0.52260 -0.47430 0.04829
magnitude: 1.43367 au
magnitude: 3.64409 debye
temp: 298.15 k
press: 1.00 atm
zeropoint: 0.09966720 hartree
thermalvibcorrection: 0.00450022 hartree
thermalrotcorrection: 0.00141627 hartree
thermaltrasncorrection: 0.00141627 hartree
thermaltotal: -2664.45402486 hartree
thermalcorr: 0.00733277 hartree
nonthermalcorr: 0.09966720 hartree
totalcorr: 0.10699997 hartree
thermalcorrenthalpy: 0.00094421 hartree
totalenthalpy: -2664.45308065 hartree
vibrat: 0.00766539 hartree
rotat: 0.01344232 hartree
transl: 0.01954630 hartree
total: 0.04065401 hartree
totalentropycorr: -0.04065401 hartree
gibbsenthalpy: -2664.49373466 hartree
gibbsminuselec: 0.06729017 hartree
