program: Orca
programVersion: 5.0.4
elementType: O Se N C C C C N C C C C H H H H H H H H
charge: 0
multiplicity: 1
keywords: Opt RIJCOSX PBEh-3c
formula: C8H8N2OSe
InChI: InChI=1/C8H8N2OSe/c11-12(9-5-1-2-6-9)10-7-3-4-8-10/h1-8H
20 atoms
O  0.046614 -2.404651 -1.376917
Se -0.025455 -1.909928 0.140409
N  1.379322 -0.730334 0.266335
C  1.949549 -0.04168 -0.775476
C  2.89937 0.783064 -0.249649
C  2.905893 0.595337 1.160065
C  1.957976 -0.339017 1.451681
N  -1.398107 -0.683709 0.122713
C  -1.860681 -0.000835 -0.975182
C  -2.829688 0.856682 -0.545258
C  -2.961439 0.694451 0.861119
C  -2.066579 -0.257556 1.247429
H  1.645288 -0.210507 -1.794608
H  3.533341 1.447279 -0.814004
H  3.54477 1.086794 1.875269
H  1.658257 -0.761314 2.397434
H  -1.476851 -0.196445 -1.962086
H  -3.396691 1.52614 -1.17152
H  -3.645248 1.215296 1.511228
H  -1.859642 -0.668867 2.222418
totalener: -2893.68488879 hartree
nucrepener: 1051.01373482 hartree
electener: -3944.69862361 hartree
oneelecener: -6100.46638477 hartree
twoeener: 2155.76776115 hartree
kineticenergy: 2888.32169701 hartree
exchangeener: -85.122869325515 hartree
correlationener: -5.588386677094 hartree
xcener: -90.711256002610 hartree
dispersion: -0.013051931 hartree
dispersion: -0.013053992 hartree
energy: -12399.1649 -1602.2151 -1437.3947 -1437.3890 -1437.3224 -530.5226 -400.2798 -400.2780 -285.1848 -285.1773 -285.0415 -285.0396 -284.1025 -284.0963 -284.0561 -284.0505 -225.0100 -167.5471 -167.5139 -167.3249 -65.6887 -65.6607 -65.4957 -65.4685 -65.4132 -31.2763 -29.7982 -29.5509 -24.6303 -23.6758 -22.5496 -22.4620 -20.9191 -17.9567 -17.8328 -17.7839 -17.2203 -17.0745 -15.9030 -14.1399 -13.8335 -13.7207 -13.5091 -12.9229 -12.8680 -12.8481 -12.5582 -12.1243 -12.0785 -11.9554 -10.1850 -9.3513 -8.5565 -8.0859 -7.4385 -7.2389 -0.1283 -0.1114 1.2741 1.8439 2.0983 2.6206 2.9561 4.4024 4.8385 5.1897 5.4223 5.8271 5.8907 6.0615 6.0757 6.4259 6.6089 7.0249 7.1748 8.7186 9.4364 9.4799 9.6428 10.3104 11.6101 12.2058 12.2551 12.5778 13.2078 14.4067 14.9524 14.9604 15.1159 15.4804 15.6439 16.1353 16.3382 16.4998 16.8636 16.9147 17.1611 17.2287 17.8851 18.0645 18.3060 18.4835 18.5701 19.2920 20.3617 20.6490 21.6021 22.1632 22.4356 23.0303 23.0411 23.4764 24.4169 24.6638 24.9331 25.3180 25.4164 25.8802 25.9081 27.3468 27.5008 27.9184 27.9378 28.1074 28.4656 29.0160 29.8215 30.3293 30.6655 31.1091 31.1243 32.0435 32.6368 35.3277 36.8891 36.9748 37.9233 38.1876 38.4519 38.8836 39.0103 39.3775 39.3947 40.1065 40.8843 43.2715 43.3045 43.6206 43.9481 44.0829 46.5559 50.2923 51.2516 51.4716 51.8235 52.0590 52.6608 53.9266 55.5912 55.5939 55.9295 56.6087 56.9409 57.2269 57.6686 58.1715 58.6029 58.7543 61.3090 61.3426 62.6386 62.7522 63.1959 63.3287 63.4751 63.7806 64.5462 64.8318 65.0292 65.5653 67.4151 70.5340 71.2517 71.4629 71.7845 73.0442 73.1018 74.6703 74.8866 76.4378 77.2341 81.5454 81.7749 82.0433 82.2933 84.6028 84.6220 88.8289 91.1457 91.1833 94.3731 95.9911 364.1471 364.3750 372.5044 372.7644 381.0873 381.3137 389.8384 389.8977 524.4975 525.1768 695.7594 electronvolt
chargesum: 0.0000000
charge: -0.651509 1.228182 -0.618352 -0.007663 -0.297631 -0.297756 -0.018506 -0.618966 -0.008764 -0.297834 -0.297469 -0.017872 0.268890 0.219972 0.220032 0.243350 0.268934 0.219983 0.219979 0.243001
charge: -0.530881 0.938142 -0.166426 -0.109320 -0.181839 -0.182198 -0.127140 -0.166649 -0.109749 -0.182263 -0.182304 -0.127044 0.148886 0.139924 0.139413 0.135706 0.148879 0.139863 0.139396 0.135604
qa: -0.6515 1.2282 -0.6184 -0.0077 -0.2976 -0.2978 -0.0185 -0.6190 -0.0088 -0.2978 -0.2975 -0.0179 0.2689 0.2200 0.2200 0.2433 0.2689 0.2200 0.2200 0.2430
va: 1.9031 3.4615 3.2020 3.6620 3.8770 3.8802 3.6545 3.2017 3.6622 3.8768 3.8808 3.6545 0.8973 0.9207 0.9209 0.9022 0.8972 0.9206 0.9208 0.9023
dispersion: -0.013055585 hartree
energy: -2893.662347691480 hartree
dipole: 0.24616 -0.29017 -0.04400 20.66924 -20.49909 0.17015 0.93950 0.00481 0.94431
magnitude: 0.96053 au
magnitude: 2.44146 debye
