program: Orca
programVersion: 5.0.4
elementType: O Se N C C C C N C C C C H H H H H H H H
charge: 0
multiplicity: 1
keywords: SP DSD-BLYP D3BJ def2-QZVPP def2-QZVPP/C def2/J TightSCF
formula: C8H8N2OSe
InChI: InChI=1/C8H8N2OSe/c11-12(9-5-1-2-6-9)10-7-3-4-8-10/h1-8H
20 atoms
O  0.05362 -1.62044 -1.47778
Se -0.018449 -1.125717 0.039546
N  1.386328 0.053877 0.165471
C  1.956555 0.74253 -0.876339
C  2.906376 1.567275 -0.350513
C  2.912899 1.379548 1.059202
C  1.964982 0.445194 1.350818
N  -1.391101 0.100501 0.02185
C  -1.853675 0.783375 -1.076045
C  -2.822682 1.640893 -0.646122
C  -2.954433 1.478662 0.760255
C  -2.059573 0.526655 1.146566
H  1.652294 0.573704 -1.895471
H  3.540347 2.23149 -0.914867
H  3.551776 1.871005 1.774405
H  1.665263 0.022897 2.29657
H  -1.469845 0.587766 -2.06295
H  -3.389685 2.310351 -1.272383
H  -3.638242 1.999506 1.410364
H  -1.852636 0.115344 2.121554
totalener: -2893.74851235 hartree
nucrepener: 1051.05870134 hartree
electener: -3944.80721369 hartree
oneelecener: -6100.90833366 hartree
twoeener: 2156.10111997 hartree
kineticenergy: 2890.83156922 hartree
exchangeener: -47.025222373376 hartree
correlationener: -2.341624879840 hartree
xcener: -49.366847253215 hartree
chargesum: -0.0000000
charge: -0.652919 1.028512 -0.295906 -0.000721 -0.121987 -0.121037 -0.016234 -0.295760 -0.004677 -0.121744 -0.121986 -0.013716 0.117827 0.085432 0.085039 0.080626 0.119368 0.086301 0.084423 0.079158
charge: -0.298584 0.848285 0.179637 -0.082138 0.029121 0.027873 -0.110280 0.180119 -0.082398 0.028545 0.027605 -0.110369 -0.078833 -0.075513 -0.075718 -0.088636 -0.079024 -0.075440 -0.075567 -0.088685
qa: -0.6529 1.0285 -0.2959 -0.0007 -0.1220 -0.1210 -0.0162 -0.2958 -0.0047 -0.1217 -0.1220 -0.0137 0.1178 0.0854 0.0850 0.0806 0.1194 0.0863 0.0844 0.0792
va: 1.8129 3.6080 3.2297 3.7979 3.8266 3.8343 3.8079 3.2277 3.7987 3.8275 3.8347 3.8097 1.0040 1.0078 1.0061 1.0086 1.0038 1.0075 1.0066 1.0087
total: -2895.030321342 hartree
dispersion: -0.017926566 hartree
energy: -2895.048247908145 hartree
dipole: 0.24616 -0.29389 -0.04772 20.66924 -20.39524 0.27400 0.93950 0.10213 1.04163
magnitude: 1.07812 au
magnitude: 2.74035 debye
