program: Orca
programVersion: 5.0.4
elementType: Se F C H H H H
charge: 1
multiplicity: 1
keywords: Freq RIJCOSX PBEh-3c
frequency: 0.00 0.00 0.00 0.00 0.00 0.00 163.90 249.30 577.99 749.44 799.85 918.49 981.24 1069.85 1400.32 1476.44 1485.99 2465.40 3115.64 3229.41 3255.61
frequency: 163.90 249.30 577.99 749.44 799.85 918.49 981.24 1069.85 1400.32 1476.44 1485.99 2465.40 3115.64 3229.41 3255.61
formula: CH4FSe
InChI: InChI=1/CH4FSe/c1-3-2/h3H,1H3
7 atoms
Se 0.975561 0.363189 -0.65455
F  1.720834 -1.113146 -0.273125
C  -0.791485 -0.038379 0.01465
H  1.432986 1.096461 0.535473
H  -0.712554 -0.505559 0.995853
H  -1.347768 0.89952 0.081693
H  -1.277575 -0.701987 -0.699995
totalener: -2540.20319692 hartree
nucrepener: 213.45883499 hartree
electener: -2753.66203191 hartree
oneelecener: -3945.84411318 hartree
twoeener: 1192.18208128 hartree
kineticenergy: 2537.61065089 hartree
exchangeener: -57.508436733619 hartree
correlationener: -2.936491680479 hartree
xcener: -60.444928414098 hartree
energy: -12405.1856 -1608.3719 -1443.5721 -1443.5057 -1443.4846 -690.0235 -291.2834 -231.1208 -173.7283 -173.5558 -173.4266 -71.8317 -71.7590 -71.6482 -71.5008 -71.4619 -42.7428 -30.7958 -26.9073 -22.2972 -21.3023 -21.0783 -19.6456 -19.2573 -18.4572 -17.0070 -7.7141 -5.8471 -4.1751 -1.1167 -0.7448 -0.4789 3.6159 5.1942 5.5760 6.3307 6.5984 7.2933 7.7296 9.3410 10.2974 11.0467 12.6418 16.2789 21.4373 21.8093 22.2676 22.9014 26.8401 27.9955 28.0926 28.3797 28.8336 29.7325 33.7971 34.4724 38.6638 42.1049 43.0359 51.5275 55.6319 55.7704 65.0169 78.1825 79.2393 81.5183 84.4652 86.5166 366.0490 881.0540 electronvolt
chargesum: 1.0000000
charge: 0.928371 -0.368066 -0.834158 0.257860 0.345564 0.327683 0.342746
charge: 0.941876 -0.254366 -0.438600 0.163568 0.196656 0.194764 0.196102
qa: 0.9284 -0.3681 -0.8342 0.2579 0.3456 0.3277 0.3427
va: 2.8506 0.9885 3.5759 0.9109 0.8516 0.8602 0.8537
dispersion: -0.002090102 hartree
energy: -2540.187351126935 hartree
dipole: -6.98418 5.99704 -0.98714 -1.45054 2.26152 0.81098 4.19279 -3.75130 0.44149
magnitude: 1.35169 au
magnitude: 3.43572 debye
temp: 298.15 k
press: 1.00 atm
zeropoint: 0.04998043 hartree
thermalvibcorrection: 0.00158845 hartree
thermalrotcorrection: 0.00141627 hartree
thermaltrasncorrection: 0.00141627 hartree
thermaltotal: -2540.13294970 hartree
thermalcorr: 0.00442100 hartree
nonthermalcorr: 0.04998043 hartree
totalcorr: 0.05440142 hartree
thermalcorrenthalpy: 0.00094421 hartree
totalenthalpy: -2540.13200549 hartree
vibrat: 0.00262425 hartree
rotat: 0.01143916 hartree
transl: 0.01905683 hartree
total: 0.03312024 hartree
totalentropycorr: -0.03312024 hartree
gibbsenthalpy: -2540.16512573 hartree
gibbsminuselec: 0.02222540 hartree
