program: Orca
programVersion: 5.0.4
elementType: Se C O H H H H
charge: 0
multiplicity: 1
keywords: Freq RIJCOSX PBEh-3c
frequency: 0.00 0.00 0.00 0.00 0.00 0.00 184.62 254.72 571.98 753.12 911.70 950.12 957.39 1053.70 1374.24 1504.04 1519.70 2251.95 3128.43 3237.85 3247.47
frequency: 184.62 254.72 571.98 753.12 911.70 950.12 957.39 1053.70 1374.24 1504.04 1519.70 2251.95 3128.43 3237.85 3247.47
formula: CH4OSe
InChI: InChI=1/CH4OSe/c1-3-2/h3H,1H3
7 atoms
Se 1.062625 0.325989 0.555288
C  -0.791334 0.020108 -0.015519
O  1.748287 -1.148909 0.569293
H  1.374741 0.948147 -0.771261
H  -0.788784 -0.639435 -0.881763
H  -1.285647 0.960848 -0.258441
H  -1.319688 -0.466847 0.802502
totalener: -2515.87380810 hartree
nucrepener: 202.64621076 hartree
electener: -2718.52001886 hartree
oneelecener: -3903.08921080 hartree
twoeener: 1184.56919194 hartree
kineticenergy: 2513.43320622 hartree
exchangeener: -56.639323843284 hartree
correlationener: -2.920851734092 hartree
xcener: -59.560175577376 hartree
energy: -12397.2138 -1600.4107 -1435.5809 -1435.5699 -1435.5341 -529.0810 -284.9796 -223.2124 -165.7331 -165.7215 -165.5660 -63.8629 -63.8464 -63.7218 -63.6801 -63.6419 -28.8744 -22.9844 -19.5467 -14.2521 -13.7041 -12.6658 -12.2949 -10.8872 -8.4871 -7.7258 0.8286 1.4018 2.5583 4.2842 4.8318 5.1217 9.6843 11.5730 11.9695 12.9062 14.2333 14.4406 15.1106 16.3282 16.9756 18.1494 19.0243 23.0492 27.1318 27.3520 28.3780 29.0826 30.9918 31.5716 32.9405 33.9119 46.6554 47.7278 52.3100 52.4975 52.8181 56.1017 57.1806 57.5801 61.9473 62.1763 67.9783 86.0996 86.9003 89.2180 91.8231 95.7536 372.1651 694.5754 electronvolt
chargesum: -0.0000000
charge: 0.677401 -0.842939 -0.695040 0.077991 0.276290 0.240468 0.265830
charge: 0.609669 -0.499015 -0.598695 0.041349 0.154415 0.141802 0.150474
qa: 0.6774 -0.8429 -0.6950 0.0780 0.2763 0.2405 0.2658
va: 3.3605 3.6845 1.7850 0.9432 0.8876 0.9005 0.8923
dispersion: -0.002223352 hartree
energy: -2515.860411633184 hartree
dipole: -6.90693 5.88763 -1.01930 -2.12354 3.30720 1.18366 -3.71072 3.37712 -0.33361
magnitude: 1.59728 au
magnitude: 4.05997 debye
temp: 298.15 k
press: 1.00 atm
zeropoint: 0.04989419 hartree
thermalvibcorrection: 0.00152174 hartree
thermalrotcorrection: 0.00141627 hartree
thermaltrasncorrection: 0.00141627 hartree
thermaltotal: -2515.80616316 hartree
thermalcorr: 0.00435428 hartree
nonthermalcorr: 0.04989419 hartree
totalcorr: 0.05424847 hartree
thermalcorrenthalpy: 0.00094421 hartree
totalenthalpy: -2515.80521895 hartree
vibrat: 0.00247488 hartree
rotat: 0.01131391 hartree
transl: 0.01901907 hartree
total: 0.03280786 hartree
totalentropycorr: -0.03280786 hartree
gibbsenthalpy: -2515.83802681 hartree
gibbsminuselec: 0.02238482 hartree
