program: Orca
programVersion: 5.0.4
elementType: Se C H H H H
charge: 2
multiplicity: 1
keywords: Freq RIJCOSX PBEh-3c
frequency: 0.00 0.00 0.00 0.00 0.00 0.00 290.99 626.74 700.18 796.28 955.99 1060.84 1114.63 1414.17 2325.38 2514.15 2626.09 3198.18
frequency: 290.99 626.74 700.18 796.28 955.99 1060.84 1114.63 1414.17 2325.38 2514.15 2626.09 3198.18
formula: CH4Se
InChI: InChI=1/CH4Se/c1-2/h2H,1H3
6 atoms
Se 1.129718 -0.770996 0.26325
C  -0.445127 0.081783 -0.001121
H  2.038004 0.27192 -0.296711
H  -1.194839 -0.660181 -0.465892
H  -0.454016 1.073791 -0.461483
H  -1.073839 0.003683 0.962056
totalener: -2439.87726812 hartree
nucrepener: 104.62912971 hartree
electener: -2544.50639782 hartree
oneelecener: -3578.33095888 hartree
twoeener: 1033.82456105 hartree
kineticenergy: 2437.99251415 hartree
exchangeener: -51.658923833452 hartree
correlationener: -2.459571108053 hartree
xcener: -54.118494941505 hartree
energy: -12413.1492 -1616.3764 -1451.5990 -1451.4922 -1451.4605 -299.2329 -239.0856 -181.7771 -181.4531 -181.3376 -79.8213 -79.7365 -79.6330 -79.3838 -79.3366 -39.0569 -33.9326 -28.2450 -27.0015 -26.0258 -25.1935 -19.4495 -12.7406 -11.2719 -8.5888 -8.1508 -6.4172 -4.5159 -2.1470 -1.3380 -0.9291 -0.6576 -0.1393 0.8378 2.6884 3.7551 4.9152 7.1722 8.7893 12.7326 13.9744 15.7734 16.2848 21.2960 34.4140 35.0006 44.0096 45.1155 46.9330 68.6522 71.1939 71.8177 72.4522 77.4767 357.3323 electronvolt
chargesum: 2.0000000
charge: 1.060776 -0.922830 0.382454 0.507140 0.465338 0.507122
charge: 1.209065 -0.416003 0.258063 0.344301 0.260062 0.344512
qa: 1.0608 -0.9228 0.3825 0.5071 0.4653 0.5071
va: 2.5098 3.4539 0.8429 0.7216 0.7768 0.7217
dispersion: -0.001606824 hartree
energy: -2439.865300873303 hartree
dipole: -6.54372 5.24647 -1.29725 4.50607 -3.55093 0.95514 -1.54332 1.20929 -0.33403
magnitude: 1.64522 au
magnitude: 4.18182 debye
temp: 298.15 k
press: 1.00 atm
zeropoint: 0.04014953 hartree
thermalvibcorrection: 0.00087300 hartree
thermalrotcorrection: 0.00141627 hartree
thermaltrasncorrection: 0.00141627 hartree
thermaltotal: -2439.82144579 hartree
thermalcorr: 0.00370555 hartree
nonthermalcorr: 0.04014953 hartree
totalcorr: 0.04385508 hartree
thermalcorrenthalpy: 0.00094421 hartree
totalenthalpy: -2439.82050158 hartree
vibrat: 0.00126233 hartree
rotat: 0.00998205 hartree
transl: 0.01879864 hartree
total: 0.03004302 hartree
totalentropycorr: -0.03004302 hartree
gibbsenthalpy: -2439.85054461 hartree
gibbsminuselec: 0.01475627 hartree
