program: Orca
programVersion: 5.0.4
elementType: F N F Se F N C C C C C H H H H H H
charge: 1
multiplicity: 1
keywords: SP DSD-BLYP D3BJ def2-QZVPP def2-QZVPP/C def2/J TightSCF
formula: C5H6F3N2Se
InChI: InChI=1/C5H6F3N2Se/c6-10(7)11(8)9-4-2-1-3-5-9/h2-5H,1H2
17 atoms
F  2.872579 0.852853 0.000928
N  1.557434 1.068573 -0.221879
F  1.459406 1.117482 -1.572851
Se 0.741966 -0.679918 0.177876
F  1.05175 -0.336919 1.833099
N  -0.890694 -0.191747 -0.088443
C  -1.797274 -1.156425 -0.627091
C  -3.086934 -0.884336 -0.748277
C  -3.707575 0.402334 -0.330633
C  -2.700663 1.330346 0.249453
C  -1.407851 1.054741 0.363735
H  -1.366556 -2.095436 -0.949213
H  -3.714997 -1.649046 -1.18469
H  -4.205956 0.875067 -1.184246
H  -4.508406 0.218309 0.39369
H  -3.030618 2.296705 0.606444
H  -0.701683 1.747983 0.795114
totalener: -3002.13225621 hartree
nucrepener: 1041.62252703 hartree
electener: -4043.75478324 hartree
oneelecener: -6221.49237436 hartree
twoeener: 2177.73759112 hartree
kineticenergy: 2999.12986999 hartree
exchangeener: -48.691017256377 hartree
correlationener: -2.357149118680 hartree
xcener: -51.048166375057 hartree
chargesum: 1.0000000
charge: -0.132397 0.168133 -0.142631 1.161633 -0.341333 -0.332923 0.046630 -0.079791 0.002603 -0.077673 0.044050 0.097633 0.133743 0.095785 0.093039 0.137689 0.125809
charge: 0.176212 -0.399002 0.165298 0.969219 -0.031552 0.135766 -0.076714 0.116705 0.119061 0.125405 -0.063405 -0.063549 -0.036877 -0.018341 -0.018554 -0.035421 -0.064251
qa: -0.1324 0.1681 -0.1426 1.1616 -0.3413 -0.3329 0.0466 -0.0798 0.0026 -0.0777 0.0441 0.0976 0.1337 0.0958 0.0930 0.1377 0.1258
va: 1.0277 2.8495 1.0238 3.4869 0.9881 3.2700 3.7436 3.8419 3.8499 3.8229 3.7252 0.9913 0.9848 0.9816 0.9808 0.9850 0.9958
total: -3003.439272614 hartree
dispersion: -0.013766428 hartree
energy: -3003.453039041806 hartree
dipole: -29.06221 27.31496 -1.74725 6.79340 -7.46437 -0.67096 -3.50235 3.11606 -0.38629
magnitude: 1.91110 au
magnitude: 4.85762 debye
