program: Orca
programVersion: 5.0.4
elementType: F N F Se N C C C C C O H H H H H H
charge: 0
multiplicity: 1
keywords: SP DSD-BLYP D3BJ def2-QZVPP def2-QZVPP/C def2/J TightSCF
formula: C5H6F2N2OSe
InChI: InChI=1/C5H6F2N2OSe/c6-9(7)11(10)8-4-2-1-3-5-8/h2-5H,1H2
17 atoms
F  1.140184 -0.841129 -1.628024
N  1.799316 -0.872652 -0.430717
F  1.282378 -2.004385 0.175339
Se 0.933015 0.563261 0.684969
N  -0.794417 0.282843 0.23467
C  -1.342489 0.862552 -0.916872
C  -2.546688 0.528025 -1.365576
C  -3.417509 -0.506967 -0.720499
C  -2.746936 -1.070911 0.494367
C  -1.540573 -0.695184 0.902665
O  1.353831 1.882277 -0.111148
H  -0.735701 1.618771 -1.393427
H  -2.914096 1.039029 -2.245134
H  -3.653454 -1.305976 -1.433462
H  -4.387648 -0.073304 -0.450333
H  -3.269887 -1.815447 1.079074
H  -1.088867 -1.11957 1.790303
totalener: -2977.78536952 hartree
nucrepener: 1030.02552906 hartree
electener: -4007.81089858 hartree
oneelecener: -6183.95812459 hartree
twoeener: 2176.14722600 hartree
kineticenergy: 2974.83497424 hartree
exchangeener: -48.205961048632 hartree
correlationener: -2.346946441657 hartree
xcener: -50.552907490289 hartree
chargesum: -0.0000000
charge: -0.200609 0.121574 -0.229464 1.013485 -0.434665 0.062244 -0.163403 0.026842 -0.165207 0.081316 -0.626776 0.143010 0.094268 0.051465 0.049587 0.087813 0.088518
charge: 0.112881 -0.427132 0.074912 0.759275 0.136998 -0.100217 0.066419 0.082967 0.067750 -0.124172 -0.297134 -0.064287 -0.065716 -0.043263 -0.044072 -0.065601 -0.069608
qa: -0.2006 0.1216 -0.2295 1.0135 -0.4347 0.0622 -0.1634 0.0268 -0.1652 0.0813 -0.6268 0.1430 0.0943 0.0515 0.0496 0.0878 0.0885
va: 0.9629 2.5558 0.9254 3.6324 3.0471 3.7603 3.8124 3.8358 3.8323 3.7950 1.8586 0.9834 0.9963 0.9817 0.9800 0.9964 0.9885
total: -2979.093874387 hartree
dispersion: -0.014265234 hartree
energy: -2979.108139621191 hartree
dipole: -26.87487 25.75720 -1.11767 -4.68752 4.25054 -0.43697 -8.19226 9.01333 0.82107
magnitude: 1.45406 au
magnitude: 3.69592 debye
