program: Orca
programVersion: 5.0.4
elementType: F N F Se N C C C C C H H H H H H
charge: 2
multiplicity: 1
keywords: Opt RIJCOSX PBEh-3c
formula: C5H6F2N2Se
InChI: InChI=1/C5H6F2N2Se/c6-9(7)10-8-4-2-1-3-5-8/h2-5H,1H2
16 atoms
F  3.607843 1.928622 -0.621872
N  3.000186 0.936966 0.04863
F  4.001743 0.283556 0.658341
Se 2.339054 -0.290769 -1.301236
N  0.571343 -0.218632 -0.708665
C  -0.273084 -1.078448 -1.356508
C  -1.602196 -1.113324 -1.039424
C  -2.139513 -0.246803 -0.010527
C  -1.18358 0.627979 0.631352
C  0.140753 0.622806 0.269218
H  0.142768 -1.72937 -2.117377
H  -2.250636 -1.804029 -1.567688
H  -3.008696 0.33576 -0.397119
H  -2.702152 -0.837283 0.750587
H  -1.506611 1.308833 1.411668
H  0.862677 1.274238 0.74082
totalener: -2901.80105405 hartree
nucrepener: 844.97151434 hartree
electener: -3746.77256839 hartree
oneelecener: -5674.19541344 hartree
twoeener: 1927.42284505 hartree
kineticenergy: 2896.90513606 hartree
exchangeener: -82.276810516353 hartree
correlationener: -5.101288205752 hartree
xcener: -87.378098722104 hartree
dispersion: -0.009228865 hartree
dispersion: -0.009228909 hartree
dispersion: -0.009228994 hartree
dispersion: -0.009228566 hartree
dispersion: -0.009227240 hartree
dispersion: -0.009228153 hartree
energy: -12407.1846 -1610.4175 -1445.6114 -1445.5587 -1445.5120 -692.8631 -692.8478 -413.3181 -413.0468 -296.4209 -296.3417 -296.1438 -296.0313 -295.0511 -233.1337 -175.7556 -175.5944 -175.3747 -73.8637 -73.8131 -73.6117 -73.4656 -73.4377 -48.0638 -45.2105 -41.2663 -36.0184 -34.7722 -34.2502 -31.7576 -30.7521 -30.1264 -27.3812 -26.4763 -26.2934 -25.9523 -25.4432 -25.0327 -24.7264 -24.3485 -23.6760 -23.1270 -22.6075 -22.1189 -22.0453 -21.7426 -21.6853 -19.2163 -18.1755 -18.0806 -14.0231 -10.8373 -10.2966 -9.7256 -7.9137 -5.5867 -5.3426 -5.2046 -4.8066 -4.2149 -3.5010 -3.4784 -3.1873 -3.0506 -2.1753 -2.1018 -1.1524 -0.2255 0.4225 1.3059 2.4150 3.0359 3.3847 3.6976 4.1663 4.7066 4.8426 5.3918 5.5866 5.7212 6.0271 6.1794 7.0830 7.5904 7.7794 8.2846 8.9272 9.0900 10.3266 11.2734 12.0545 12.6855 14.5209 15.0395 16.0543 16.1112 16.4039 16.4424 16.5619 17.1215 17.5770 18.0778 18.6033 19.0641 20.1859 21.1679 21.3273 22.8245 23.5382 23.5968 24.1622 24.2783 24.9739 25.3294 25.8822 25.9795 26.2315 26.9170 27.2079 27.7756 28.7217 29.0393 29.2239 29.9704 30.1492 31.0274 31.5721 32.6541 34.1242 35.3428 37.6195 38.0921 39.8055 40.8086 41.2010 43.3621 43.9260 44.4796 44.6393 45.6565 48.1888 48.3980 48.7450 49.4642 50.0469 50.9314 51.5484 52.3854 53.5705 53.6175 53.7397 55.7923 56.4091 59.2506 60.3522 60.5702 62.3638 62.4506 63.1094 64.4694 65.5144 71.0678 72.9079 77.3806 77.7768 77.9771 80.0080 81.9359 82.5286 84.7779 353.8139 358.4207 368.0804 373.3107 376.6837 509.1115 514.2508 881.3573 890.9064 electronvolt
chargesum: 2.0000000
charge: -0.184577 0.332034 -0.182941 0.833094 -0.544969 0.087823 -0.168019 -0.565078 -0.151028 0.085949 0.391814 0.393756 0.436035 0.435967 0.395256 0.404884
charge: -0.093865 0.216757 -0.091212 0.681149 0.038373 -0.022698 0.051362 -0.240554 0.065145 -0.023440 0.205283 0.222528 0.280782 0.280946 0.222347 0.207098
qa: -0.1846 0.3320 -0.1829 0.8331 -0.5450 0.0878 -0.1680 -0.5651 -0.1510 0.0859 0.3918 0.3938 0.4360 0.4360 0.3953 0.4049
va: 1.1156 2.9841 1.1198 2.4017 3.3755 3.5007 3.6050 3.5172 3.5612 3.4690 0.8153 0.8321 0.7807 0.7806 0.8306 0.8191
dispersion: -0.009228123 hartree
energy: -2901.773671280552 hartree
dipole: -29.48582 23.69808 -5.78774 -0.00388 -0.96309 -0.96697 8.22142 -7.81787 0.40355
magnitude: 5.88182 au
magnitude: 14.95040 debye
