program: Gaussian 09
title: 000076440
version: EM64L-G09RevD.01
frameworkgroup: C1[X(C16H18)]
method: RPBEPBE
basis: SDD
operation: Freq
keyword: #p
keyword: freq=noraman
keyword: PBEPBE/SDD
title: #p freq=noraman PBEPBE/SDD
converged: NO YES NO NO
title: Mulliken charges:
elementType: C C C C C C C C C C C C C C C C H H H H H H H H H H H H H H H H H H
charge: -0.187390 -0.445473 -0.445474 -0.400259 -0.400259 -0.382612 0.452033 0.125227 -0.427670 0.408212 -0.401763 -0.273665 -0.469903 -0.436742 -0.260997 -0.248756 0.190953 0.217997 0.197315 0.197323 0.218000 0.191892 0.201317 0.201317 0.191891 0.188439 0.199431 0.228398 0.223347 0.223152 0.237313 0.235722 0.224566 0.227116
chargesum: 0.00000
title: Mulliken charges with hydrogens summed into heavy atoms:
elementType: C C C C C C C C C C C C C C C C
charge: 0.003564 -0.030161 -0.030150 -0.007050 -0.007051 0.005258 0.452033 0.125227 -0.199272 0.408212 -0.178415 -0.050513 -0.232590 -0.201020 -0.036431 -0.021639
polarizability: 2.21749955e+02 1.21772140e+01 1.88248934e+02 2.37657659e-03 -9.35052186e-03 1.01152196e+02
1716.lowfreq: -31.4481 -0.0011 -0.0007 0.0002 2.8966 9.6577 31.5765 64.1390 80.8948
frequency: 25.7308 63.1906 80.8944 160.9339 181.0245 192.3122 224.5843 245.5746 296.9400 331.5569 396.0843 422.6516 433.4997 457.2355 474.6670 481.9410 517.5954 520.9403 570.4503 629.4861 657.7680 732.5103 742.9505 781.9749 784.8082 788.5131 791.5806 812.9694 836.0596 863.4378 872.2388 891.7256 894.3330 912.5702 925.1142 960.3195 981.2769 982.2977 991.1281 1017.5210 1033.5526 1045.6527 1050.8753 1071.7872 1088.2636 1108.4422 1136.8386 1152.7020 1173.6803 1181.3465 1185.2945 1227.3460 1235.7071 1244.1916 1257.4489 1263.6319 1270.6007 1302.4236 1305.8023 1324.3009 1333.1111 1341.2530 1342.6501 1350.2011 1382.6176 1403.2312 1412.3010 1441.4316 1455.1528 1460.5181 1461.7438 1463.4596 1470.9323 1477.9624 1519.2025 1587.6198 1597.9027 1631.0969 2961.7030 2961.9623 2963.4907 2968.8643 2970.4038 2992.7461 3021.7414 3024.1405 3030.5418 3033.4046 3044.3298 3116.2579 3117.7800 3127.2634 3129.4551 3147.8322 3151.1318 3162.2971
redmass: 3.3849 3.4527 3.3104 3.6349 4.0631 3.0676 1.7713 4.2459 3.6088 1.9248 2.8655 3.0262 2.9975 3.5330 3.2507 2.1183 3.0345 6.0885 3.1992 5.0394 3.3665 3.5496 1.2840 3.8777 1.4515 3.6243 1.8469 1.5512 2.7113 1.8682 1.7336 2.6174 1.6349 1.5210 1.7113 1.3842 2.7855 1.3574 1.3537 2.9812 2.2092 1.8687 1.3952 1.2498 2.2677 2.5194 2.1944 1.4487 1.1052 1.4480 1.2529 1.4961 1.8906 1.5447 1.2900 1.6376 1.5240 1.2390 1.4033 1.3094 1.3657 1.5301 1.4728 1.4920 1.9431 2.9948 3.8985 2.4836 2.2508 1.0865 1.1148 1.0889 1.0874 1.1004 3.6904 7.4085 5.1794 6.3873 1.0622 1.0616 1.0638 1.0611 1.0639 1.0805 1.0972 1.0945 1.1012 1.1030 1.1025 1.0853 1.0857 1.0909 1.0884 1.0939 1.0992 1.0993
irintensity: 0.0896 0.0772 0.0169 0.0765 2.3097 0.1728 0.1842 0.0407 2.0684 0.4125 1.4340 5.7376 4.9884 2.5710 0.5716 0.7121 1.0111 0.3984 5.3920 4.0937 0.4310 0.7781 4.0997 0.2677 0.6410 0.0641 75.4694 56.4186 5.0967 4.3033 13.3455 0.1049 1.5567 2.5250 0.3303 2.0023 17.9137 1.3547 0.8506 0.8034 8.1872 1.2723 0.1358 0.0661 7.6944 0.0001 4.3119 0.4371 2.3008 0.7771 0.3553 0.1425 4.7508 0.4600 1.8519 3.1623 2.7121 0.1415 4.4715 0.0127 0.0659 1.7990 0.5873 0.2416 16.6067 1.7641 5.5516 5.8941 0.3646 1.5662 8.9474 10.3068 22.4360 1.1925 9.1158 6.6593 6.3619 0.2634 29.8482 44.2126 38.1765 20.2513 10.4161 18.7159 87.1630 79.6149 10.9126 6.5545 114.7581 3.4642 0.5245 24.3596 10.9982 39.6146 40.2596 26.8455
temp: 298.150 k
press: 1.00000 atm
elementType: 6 6 6 6 6 6 6 6 6 6 6 6 6 6 6 6 1 1 1 1 1 1 1 1 1 1 1 1 1 1 1 1 1 1
symmnumber: 1
zpe: 769474.0 jmol-1
zpe.correction: 0.293077 hartree
zpe.thermalcorrener: 0.306172 hartree
zpe.thermalcorrenthalpy: 0.307116 hartree
zpe.thermalcorrgfe: 0.252934 hartree
zpe.sumelectzpe: -619.364148 hartree
zpe.sumelectthermal: -619.351053 hartree
zpe.sumelectthermalent: -619.350109 hartree
zpe.sumelectthermalfe: -619.404291 hartree
dipole: 0.6447 -0.1287 0.0000
dipole: 0.6575
quadrupole: -87.8734 -87.9383 -101.4490
quadrupole: 0.2288 0.0006 -0.0018
quadrupole: 4.5468 4.4820 -9.0288 0.2288 0.0006 -0.0018
hfenergy: -619.6572254 hartree
pointgroup: C01 [X(C16H18)]
dipole: 0.2535258 0.051325 -0.0000026 debye
polarizability: 221.8147425|-12.0875929|188.1841467|-0.0023516|-0.0093568|101.1521955 unknown
InChI: InChI=1S/C16H18/c1-2-7-13(8-3-1)16-12-6-10-14-9-4-5-11-15(14)16/h4-6,9-13H,1-3,7-8H2
charge 0 multiplicity 1
34 atoms
C  1.46382 0.222147 -0.000072
C  2.291347 -0.112248 -1.276775
C  2.291234 -0.111776 1.27683
C  3.656515 0.616286 -1.275899
C  3.656408 0.616745 1.275811
C  4.469651 0.292407 0.000047
C  0.104369 -0.481474 0.000044
C  -1.154342 0.240039 0.000014
C  0.07186 -1.885603 0.00021
C  -2.402282 -0.511375 0.000159
C  -1.246485 1.675488 -0.000172
C  -1.15127 -2.618724 0.00035
C  -2.371078 -1.943287 0.000327
C  -3.653315 0.191326 0.000128
C  -2.479786 2.331905 -0.000206
C  -3.698985 1.585473 -0.00005
H  1.316153 1.31986 -0.000293
H  1.707181 0.15871 -2.177785
H  2.460988 -1.207342 -1.325373
H  2.460854 -1.206854 1.325842
H  1.706995 0.159514 2.177693
H  3.486612 1.712201 -1.331411
H  4.232804 0.337004 -2.179853
H  4.232626 0.337789 2.179911
H  3.486501 1.71268 1.330913
H  4.733373 -0.786051 0.000251
H  5.423219 0.856036 -0.000008
H  1.016835 -2.442141 0.000229
H  -0.332001 2.2763 -0.000299
H  -1.125689 -3.714287 0.00047
H  -3.318333 -2.495917 0.000448
H  -4.581116 -0.394099 0.00025
H  -2.514147 3.427353 -0.000359
H  -4.661114 2.109713 -0.000074
