program: Orca
programVersion: 5.0.4
elementType: N C C C C C Se N C C C C C H H H H H H H H H H H H
charge: 2
multiplicity: 1
keywords: Opt RIJCOSX PBEh-3c
formula: C10H12N2Se
InChI: InChI=1/C10H12N2Se/c1-3-7-11(8-4-1)13-12-9-5-2-6-10-12/h3-10H,1-2H2
25 atoms
N  -1.379694 0.469662 1.21293
C  -1.24977 -0.783921 0.650641
C  -2.10088 -1.207418 -0.309575
C  -3.216899 -0.37815 -0.786733
C  -3.283046 0.940259 -0.135364
C  -2.390352 1.325412 0.796486
Se 0.038098 1.171131 2.161005
N  1.410961 0.706583 1.027852
C  1.255602 0.901675 -0.330334
C  2.078563 0.301245 -1.217841
C  3.190493 -0.562817 -0.794841
C  3.284447 -0.716695 0.666144
C  2.419896 -0.119013 1.50755
H  -0.485518 -1.429831 1.061087
H  -1.991753 -2.216706 -0.685331
H  -3.201678 -0.280636 -1.885049
H  -4.165949 -0.921438 -0.626901
H  -4.079594 1.623792 -0.399311
H  -2.432761 2.297697 1.26928
H  0.497294 1.606884 -0.642151
H  1.951239 0.523345 -2.269631
H  3.149403 -1.54322 -1.297713
H  4.138053 -0.151672 -1.187864
H  4.079864 -1.318136 1.086944
H  2.483881 -0.238235 2.58102
totalener: -2896.40357935 hartree
nucrepener: 1131.99110222 hartree
electener: -4028.39468157 hartree
oneelecener: -6226.16298737 hartree
twoeener: 2197.76830580 hartree
kineticenergy: 2890.86012955 hartree
exchangeener: -86.705714636171 hartree
correlationener: -5.803608272769 hartree
xcener: -92.509322908940 hartree
dispersion: -0.017277635 hartree
dispersion: -0.017268510 hartree
dispersion: -0.017269147 hartree
dispersion: -0.017292338 hartree
dispersion: -0.017277095 hartree
energy: -12405.7825 -1608.9782 -1444.1731 -1444.1402 -1444.0615 -409.9262 -409.9191 -294.0828 -294.0731 -293.8488 -293.8359 -293.4155 -293.4001 -293.1132 -293.0925 -292.5413 -292.5252 -231.6976 -174.3249 -174.1925 -173.9094 -72.4481 -72.4270 -72.1497 -72.0326 -71.9858 -38.8952 -38.1392 -33.6018 -33.0565 -32.2571 -32.2144 -30.7140 -28.6909 -28.1112 -28.0863 -27.8943 -25.5864 -24.3955 -23.5999 -23.5873 -23.4674 -22.7936 -22.6045 -22.3165 -22.1216 -22.0893 -21.8525 -21.1410 -20.5912 -20.5780 -19.8634 -19.5106 -19.4815 -19.4438 -17.2336 -16.9936 -16.7138 -14.5858 -12.3963 -8.7363 -8.3901 -7.7686 -7.6633 -5.7988 -5.6157 -3.4316 -3.3140 -2.9065 -2.8534 -2.5256 -2.4711 -2.1449 -2.0544 -1.8781 -1.3495 -1.3328 -1.2489 -1.2060 -1.1352 -0.6197 -0.4375 -0.1996 0.5493 0.5983 1.1076 1.7148 2.2654 2.4124 3.2063 3.7984 4.0593 4.9027 5.2123 5.5231 5.9229 6.0480 6.3297 6.6725 7.0019 7.0395 7.4657 7.7292 7.9016 8.3273 8.4419 8.6192 8.7374 9.0227 9.1239 9.5471 9.5798 10.0686 10.1588 10.5646 10.9768 11.1303 11.3045 11.8338 12.7181 13.5470 14.2200 14.6254 15.6460 16.2883 17.2647 17.8657 18.1511 18.2656 18.4123 18.4621 18.5507 18.5747 18.7374 18.9632 19.3324 19.5001 19.8774 20.2313 20.4664 20.5147 20.7235 20.7587 21.7341 22.2959 23.0272 23.2103 24.0914 24.2097 25.8598 26.1650 26.6264 26.8878 28.5482 28.6062 28.8264 29.9549 30.5076 30.9862 32.4155 32.7682 32.9387 32.9822 33.6615 33.6799 35.4333 37.3969 37.7675 38.8040 40.5712 40.8299 41.5328 41.6838 42.9102 43.6228 44.0841 44.2009 45.4644 46.8158 46.8605 46.9798 47.3632 48.5577 50.1395 50.6377 51.0442 51.0850 51.5287 51.7591 51.9701 51.9767 53.1775 53.2298 54.3600 54.4428 56.7858 56.9603 58.1050 58.1439 58.4639 58.5581 62.3632 62.9634 63.0710 63.3269 64.4142 64.6651 64.6928 64.7180 65.3879 65.7989 66.9880 67.3313 67.8082 67.9117 73.3814 73.3982 79.7655 80.2644 80.9832 82.1370 83.3473 83.8135 87.0415 356.2615 356.4906 360.0902 361.2128 370.5229 370.7166 375.9240 377.3346 379.0302 379.1140 516.7123 516.9752 electronvolt
chargesum: 2.0000000
charge: -0.580483 0.034233 -0.219751 -0.512594 -0.228520 0.042920 0.762815 -0.582589 0.033875 -0.220270 -0.512301 -0.228809 0.042034 0.336602 0.339000 0.350629 0.364972 0.345471 0.349009 0.336313 0.338969 0.350092 0.364436 0.345093 0.348850
charge: -0.076025 -0.069434 -0.025703 -0.236632 -0.037548 -0.063545 0.641226 -0.077656 -0.069755 -0.026170 -0.236592 -0.038578 -0.064167 0.175552 0.193831 0.215382 0.225204 0.197497 0.183432 0.175526 0.193777 0.214883 0.224823 0.197364 0.183309
qa: -0.5805 0.0342 -0.2198 -0.5126 -0.2285 0.0429 0.7628 -0.5826 0.0339 -0.2203 -0.5123 -0.2288 0.0420 0.3366 0.3390 0.3506 0.3650 0.3455 0.3490 0.3363 0.3390 0.3501 0.3644 0.3451 0.3489
va: 3.2538 3.5789 3.7044 3.5953 3.7100 3.5616 2.2602 3.2535 3.5791 3.7048 3.5959 3.7109 3.5614 0.8551 0.8661 0.8392 0.8280 0.8634 0.8457 0.8553 0.8661 0.8396 0.8283 0.8636 0.8458
dispersion: -0.017275947 hartree
energy: -2896.376163975152 hartree
dipole: -0.45904 0.40162 -0.05742 -14.38687 13.13365 -1.25322 -25.84825 23.58468 -2.26356
magnitude: 2.58797 au
magnitude: 6.57809 debye
