program: Orca
programVersion: 5.0.4
elementType: N C C C C C Se N C C C C C H H H H H H H H H H H H
charge: 2
multiplicity: 1
keywords: SP DSD-BLYP D3BJ def2-QZVPP def2-QZVPP/C def2/J TightSCF
formula: C10H12N2Se
InChI: InChI=1/C10H12N2Se/c1-3-7-11(8-4-1)13-12-9-5-2-6-10-12/h3-10H,1-2H2
25 atoms
N  -1.393261 0.037816 0.378591
C  -1.263336 -1.215767 -0.183698
C  -2.114446 -1.639264 -1.143914
C  -3.230466 -0.809996 -1.621071
C  -3.296612 0.508412 -0.969703
C  -2.403918 0.893566 -0.037853
Se 0.024532 0.739284 1.326666
N  1.397395 0.274737 0.193513
C  1.242035 0.469829 -1.164673
C  2.064997 -0.130601 -2.05218
C  3.176927 -0.994663 -1.62918
C  3.270881 -1.148541 -0.168194
C  2.40633 -0.550859 0.673211
H  -0.499084 -1.861677 0.226749
H  -2.005319 -2.648552 -1.51967
H  -3.215244 -0.712482 -2.719388
H  -4.179515 -1.353284 -1.46124
H  -4.093161 1.191946 -1.23365
H  -2.446327 1.865851 0.434942
H  0.483728 1.175038 -1.47649
H  1.937673 0.091499 -3.10397
H  3.135836 -1.975066 -2.132052
H  4.124487 -0.583518 -2.022203
H  4.066297 -1.749982 0.252605
H  2.470315 -0.670081 1.746681
totalener: -2896.38860990 hartree
nucrepener: 1132.02845422 hartree
electener: -4028.41706412 hartree
oneelecener: -6227.25251257 hartree
twoeener: 2198.83544845 hartree
kineticenergy: 2893.43390805 hartree
exchangeener: -47.927842886821 hartree
correlationener: -2.425744372941 hartree
xcener: -50.353587259762 hartree
chargesum: 2.0000000
charge: -0.333149 0.080349 -0.028537 0.007610 -0.028754 0.071753 0.629641 -0.335959 0.077669 -0.030977 0.007560 -0.032226 0.071053 0.144900 0.174024 0.133148 0.141865 0.171600 0.153968 0.148096 0.174549 0.133815 0.140714 0.172283 0.155003
charge: 0.204786 -0.050710 0.193759 0.136221 0.183205 -0.044624 0.962211 0.201367 -0.050577 0.192833 0.135833 0.181700 -0.045352 -0.045613 -0.020176 0.011682 0.019750 -0.020133 -0.044922 -0.045963 -0.020336 0.011187 0.019356 -0.020259 -0.045226
qa: -0.3331 0.0803 -0.0285 0.0076 -0.0288 0.0718 0.6296 -0.3360 0.0777 -0.0310 0.0076 -0.0322 0.0711 0.1449 0.1740 0.1331 0.1419 0.1716 0.1540 0.1481 0.1745 0.1338 0.1407 0.1723 0.1550
va: 3.3972 3.7315 3.8139 3.8692 3.8071 3.7531 2.3510 3.3959 3.7252 3.8156 3.8687 3.8066 3.7462 0.9809 0.9696 0.9798 0.9811 0.9723 0.9736 0.9801 0.9689 0.9795 0.9809 0.9720 0.9732
total: -2897.726708968 hartree
dispersion: -0.022196301 hartree
energy: -2897.748905268740 hartree
dipole: -0.45904 0.39336 -0.06567 -14.38687 13.19295 -1.19392 -25.84825 23.69306 -2.15519
magnitude: 2.46467 au
magnitude: 6.26469 debye
