program: Orca
programVersion: 5.0.4
elementType: F Se C C C C C C C C C C C C H H H H H H H H
charge: 1
multiplicity: 1
keywords: SP DSD-BLYP D3BJ def2-QZVPP def2-QZVPP/C def2/J TightSCF
formula: C12H8FSe
InChI: InChI=1/C12H8FSe/c13-14-11-7-3-1-5-9(11)10-6-2-4-8-12(10)14/h1-8H
22 atoms
F  0.23731 2.222743 -0.995063
Se 0.114641 1.367751 0.491568
C  1.303901 -0.06121 0.226509
C  0.623853 -1.231153 -0.133919
C  1.369691 -2.378855 -0.321249
C  2.752258 -2.333642 -0.157778
C  3.401944 -1.160404 0.198561
C  2.673618 0.004006 0.407137
C  -0.829832 -1.076977 -0.240413
C  -1.296743 0.20531 0.06711
C  -2.629672 0.567258 0.033074
C  -3.54485 -0.408203 -0.342577
C  -3.1101 -1.68947 -0.649616
C  -1.761297 -2.033141 -0.596181
H  0.891527 -3.311922 -0.587428
H  3.329645 -3.235936 -0.306398
H  4.475595 -1.150134 0.321221
H  3.175539 0.91924 0.692528
H  -2.962597 1.56742 0.277743
H  -4.596391 -0.164355 -0.392187
H  -3.833607 -2.440597 -0.935169
H  -1.454601 -3.041879 -0.837624
totalener: -2960.95825868 hartree
nucrepener: 1217.80116862 hartree
electener: -4178.75942730 hartree
oneelecener: -6505.85129170 hartree
twoeener: 2327.09186440 hartree
kineticenergy: 2957.95617750 hartree
exchangeener: -49.852976163201 hartree
correlationener: -2.528900329011 hartree
xcener: -52.381876492212 hartree
chargesum: 1.0000000
charge: -0.356484 0.773196 -0.029603 0.145335 -0.079117 -0.096522 -0.071212 -0.074338 0.149150 -0.023864 -0.083026 -0.065488 -0.091161 -0.083788 0.118286 0.133418 0.131829 0.112989 0.113850 0.130131 0.128829 0.117593
charge: -0.038692 1.194529 -0.272564 -0.104679 0.132871 0.134612 0.113522 0.078633 -0.105729 -0.272266 0.078616 0.114074 0.133713 0.133014 -0.040472 -0.035767 -0.041676 -0.041602 -0.041465 -0.041741 -0.036289 -0.040644
qa: -0.3565 0.7732 -0.0296 0.1453 -0.0791 -0.0965 -0.0712 -0.0743 0.1492 -0.0239 -0.0830 -0.0655 -0.0912 -0.0838 0.1183 0.1334 0.1318 0.1130 0.1138 0.1301 0.1288 0.1176
va: 0.9325 3.1626 3.5258 3.3884 3.7327 3.8746 3.8147 3.8191 3.3885 3.5237 3.8282 3.8137 3.8831 3.7390 0.9862 0.9768 0.9788 0.9810 0.9802 0.9797 0.9780 0.9862
total: -2962.330718906 hartree
dispersion: -0.023613417 hartree
energy: -2962.354332323144 hartree
dipole: -2.31386 2.22992 -0.08394 -26.31696 25.38177 -0.93519 -5.79304 6.27311 0.48007
magnitude: 1.05456 au
magnitude: 2.68049 debye
