program: Gaussian 09
title: 000076419
version: EM64L-G09RevD.01
frameworkgroup: C1[X(C13H14)]
method: RPBEPBE
basis: SDD
operation: Freq
keyword: #p
keyword: freq=noraman
keyword: PBEPBE/SDD
title: #p freq=noraman PBEPBE/SDD
converged: YES YES NO NO
title: Mulliken charges:
elementType: C C C C C C C C C C C C C H H H H H H H H H H H H H H
charge: 0.217645 0.167031 0.434282 0.315662 -0.648416 -0.475504 -0.390460 0.462458 -0.447064 -0.858025 -0.384881 -0.845582 -0.813441 0.240296 0.235212 0.241556 0.226276 0.251859 0.235136 0.235198 0.226449 0.231393 0.230715 0.231415 0.224276 0.228109 0.228408
chargesum: 0.00000
title: Mulliken charges with hydrogens summed into heavy atoms:
elementType: C C C C C C C C C C C C C
charge: 0.217645 0.167031 0.434282 0.315662 -0.408121 -0.240293 -0.148904 0.462458 -0.220788 -0.135833 -0.158433 -0.152059 -0.132647
polarizability: 2.16870794e+02 8.83095254e+00 1.48566801e+02 1.54481782e-02 -1.64536761e-03 6.96418894e+01
1716.lowfreq: -10.5675 -0.0006 0.0002 0.0004 3.9698 12.9116 77.9593 89.0391 110.1593
frequency: 77.9361 89.0389 110.1553 142.8836 170.4892 195.0685 217.2905 252.8966 326.6771 335.7827 341.7906 403.7159 421.3368 472.8804 503.5967 522.9001 555.9586 560.3253 630.8751 660.2316 708.2915 782.9280 784.2142 819.7673 829.8409 861.2978 907.8343 925.8440 964.6730 970.9869 992.6415 1003.8813 1024.7718 1049.5942 1051.2403 1056.2601 1086.4377 1165.9735 1183.6647 1197.1867 1246.9387 1258.3864 1276.0656 1348.4793 1383.4523 1394.6647 1395.9974 1401.1200 1414.3480 1425.9217 1463.6223 1467.6018 1467.7425 1468.6786 1485.2573 1493.0362 1494.6476 1514.3959 1582.8757 1610.0142 1639.9121 2972.3768 2973.1352 2973.9452 3041.9856 3048.7103 3049.7605 3079.8389 3082.9715 3107.3964 3112.3577 3114.3891 3116.1972 3139.6037 3153.1248
redmass: 1.4761 1.7074 1.8417 1.2691 1.0968 3.2728 3.0605 3.0079 3.1306 2.6216 3.4736 4.4076 3.0055 3.6190 4.2340 2.7842 5.7106 3.1079 4.4273 3.0040 5.9636 1.8127 4.6852 1.6336 1.4980 2.6327 1.5259 2.8646 1.3579 1.3573 1.5018 1.5986 1.4466 1.5629 1.6450 2.3565 2.0768 1.3064 1.6661 1.5267 2.2504 3.6862 1.6130 2.4134 2.7349 1.3028 1.2410 1.2026 3.9189 7.0484 1.3029 1.2257 1.0485 1.0468 1.5612 1.0458 1.3163 2.8643 6.6540 6.1086 6.5509 1.0373 1.0379 1.0400 1.0971 1.0974 1.0976 1.0981 1.0985 1.0943 1.0900 1.0871 1.0887 1.0976 1.0945
irintensity: 1.5976 0.4664 0.0576 0.6131 1.3252 1.1069 1.2196 2.2975 0.0623 0.2370 5.8652 0.0456 4.5321 3.1113 0.1162 3.8189 0.0945 0.7798 0.6892 6.9413 0.8093 0.1337 0.6194 3.5892 63.5496 1.3118 14.4453 2.8845 0.4757 3.6903 7.4578 6.0428 7.8587 13.6376 0.0879 3.9481 8.0877 0.6334 0.1467 7.4448 3.2137 5.8169 1.6944 5.2952 1.4364 9.8393 10.0713 15.2049 4.0895 2.9343 7.0378 15.6371 23.1187 14.3593 1.7115 0.1567 6.7462 22.7748 4.4805 18.8605 4.6461 60.1671 26.0218 34.5234 21.5058 22.2484 20.5780 21.8163 18.4370 22.4971 14.2490 11.7755 16.2527 37.2783 19.4526
temp: 298.150 k
press: 1.00000 atm
elementType: 6 6 6 6 6 6 6 6 6 6 6 6 6 1 1 1 1 1 1 1 1 1 1 1 1 1 1
symmnumber: 1
zpe: 595489.7 jmol-1
zpe.correction: 0.226810 hartree
zpe.thermalcorrener: 0.238877 hartree
zpe.thermalcorrenthalpy: 0.239821 hartree
zpe.thermalcorrgfe: 0.189222 hartree
zpe.sumelectzpe: -502.879189 hartree
zpe.sumelectthermal: -502.867122 hartree
zpe.sumelectthermalent: -502.866177 hartree
zpe.sumelectthermalfe: -502.916776 hartree
dipole: -0.1650 0.4812 0.0017
dipole: 0.5087
quadrupole: -66.3194 -70.0996 -82.8014
quadrupole: -0.6013 0.0062 -0.0007
quadrupole: 6.7540 2.9738 -9.7279 -0.6013 0.0062 -0.0007
hfenergy: -503.1059988 hartree
pointgroup: C01 [X(C13H14)]
dipole: -0.0592323 -0.1911037 -0.005143 debye
polarizability: 217.3365568|-6.762527|148.0535091|-0.5503894|1.9098804|69.689418 unknown
InChI: InChI=1S/C13H14/c1-9-4-7-13-11(3)10(2)5-6-12(13)8-9/h4-8H,1-3H3
charge 0 multiplicity 1
27 atoms
C  -0.083695 -0.507968 -0.008578
C  -1.50503 -0.779185 -0.011811
C  0.397254 0.857736 0.023266
C  -2.41897 0.295675 0.016289
C  1.808408 1.116338 0.025953
C  -0.557536 1.923522 0.051708
C  0.900297 -1.55505 -0.036105
C  2.749867 0.082612 -0.001625
C  -1.922335 1.642832 0.048152
C  -1.982383 -2.22271 -0.045427
C  2.266091 -1.269719 -0.032814
C  -3.92657 0.082238 0.013999
C  4.243258 0.355157 -0.00001
H  2.146207 2.160669 0.050426
H  -0.202369 2.96074 0.076268
H  0.574788 -2.600037 -0.060045
H  -2.647301 2.465537 0.070155
H  -3.080403 -2.294598 -0.046371
H  -1.614159 -2.748112 -0.947573
H  -1.613156 -2.789723 0.830799
H  2.993569 -2.09115 -0.054342
H  -4.263248 -0.503194 0.890476
H  -4.456487 1.049674 0.03902
H  -4.266543 -0.458829 -0.889305
H  4.457744 1.437071 0.033768
H  4.736127 -0.114971 0.872306
H  4.727476 -0.057557 -0.905676
