program: Orca
programVersion: 5.0.4
elementType: C C C C C C C C C C C C Se H H H H H H H H
charge: 2
multiplicity: 1
keywords: Freq RIJCOSX PBEh-3c
frequency: 0.00 0.00 0.00 0.00 0.00 0.00 101.39 104.07 191.68 204.96 252.30 276.26 379.94 384.53 402.78 414.61 448.47 454.05 506.32 579.14 674.63 704.90 706.45 737.36 785.64 807.52 817.57 910.33 929.33 953.97 1024.36 1036.73 1037.06 1056.93 1059.23 1061.47 1062.94 1116.23 1167.71 1184.87 1198.88 1248.00 1280.51 1310.88 1364.27 1368.74 1457.78 1467.32 1493.26 1517.64 1587.77 1602.76 1624.22 1644.23 1697.43 3281.10 3281.33 3286.33 3287.53 3294.36 3295.24 3308.49 3308.82
frequency: 101.39 104.07 191.68 204.96 252.30 276.26 379.94 384.53 402.78 414.61 448.47 454.05 506.32 579.14 674.63 704.90 706.45 737.36 785.64 807.52 817.57 910.33 929.33 953.97 1024.36 1036.73 1037.06 1056.93 1059.23 1061.47 1062.94 1116.23 1167.71 1184.87 1198.88 1248.00 1280.51 1310.88 1364.27 1368.74 1457.78 1467.32 1493.26 1517.64 1587.77 1602.76 1624.22 1644.23 1697.43 3281.10 3281.33 3286.33 3287.53 3294.36 3295.24 3308.49 3308.82
formula: C12H8Se
InChI: InChI=1/C12H8Se/c1-3-7-11-9(5-1)10-6-2-4-8-12(10)13-11/h1-8H
21 atoms
C  1.32835 -0.985863 0.206458
C  2.730414 -1.163781 0.299166
C  3.53903 -0.083182 0.003168
C  2.959061 1.125062 -0.365234
C  1.546209 1.295669 -0.458347
C  0.723645 0.242197 -0.176545
C  -0.74136 0.170679 -0.211821
C  -1.647895 1.139102 -0.537559
C  -3.040082 0.831596 -0.512561
C  -3.517443 -0.427188 -0.166286
C  -2.623048 -1.42406 0.17277
C  -1.241572 -1.111223 0.14589
Se 0.094055 -2.266948 0.544849
H  3.163802 -2.113443 0.590369
H  4.614691 -0.176933 0.059319
H  3.595322 1.971443 -0.593105
H  1.157863 2.261962 -0.753794
H  -1.340983 2.138583 -0.817771
H  -3.743815 1.612097 -0.774848
H  -4.580515 -0.624432 -0.160985
H  -2.97573 -2.411336 0.447267
totalener: -2860.79358813 hartree
nucrepener: 1032.59180613 hartree
electener: -3893.38539426 hartree
oneelecener: -5978.59061249 hartree
twoeener: 2085.20521823 hartree
kineticenergy: 2855.61632244 hartree
exchangeener: -84.333838819480 hartree
correlationener: -5.541746686490 hartree
xcener: -89.875585505969 hartree
energy: -12406.8152 -1610.0607 -1445.2283 -1445.2121 -1445.1868 -294.9827 -294.9814 -294.1992 -294.1962 -294.1450 -294.1362 -293.9240 -293.9236 -293.7051 -293.7001 -293.0254 -293.0244 -232.7930 -175.2964 -175.2756 -175.1710 -73.3827 -73.3745 -73.3032 -73.2760 -73.2384 -36.7337 -35.1628 -33.9625 -33.0007 -32.0290 -31.3712 -30.6322 -28.6095 -27.3924 -27.2608 -27.0013 -25.0050 -24.2953 -24.0148 -22.9348 -22.9125 -22.6982 -22.3434 -22.0424 -22.0329 -21.1714 -20.2787 -20.2241 -19.9582 -19.8485 -19.7189 -18.8272 -18.0166 -16.7843 -16.2900 -13.8654 -9.1242 -8.7490 -8.7212 -8.3300 -7.0708 -5.9563 -4.1953 -3.7982 -3.3585 -3.2844 -2.9951 -2.9908 -2.5752 -2.2620 -2.2094 -1.4939 -1.0472 -0.7965 -0.4354 -0.1623 0.3556 0.6413 0.8262 1.4638 2.5589 2.7854 2.7971 3.8961 4.1835 4.6902 4.6964 4.8164 5.7845 5.8021 5.9421 6.1535 6.5295 6.6282 7.0493 7.1721 7.5706 7.7954 8.0302 8.0733 8.4509 8.7210 8.7881 9.0286 9.0691 9.6260 9.7727 10.1839 10.5362 10.8227 10.8512 11.1054 11.2065 12.8618 13.0313 13.6848 14.5681 14.6315 14.7984 15.6015 16.7879 17.5066 17.9146 17.9162 18.5286 18.7902 19.0589 19.4129 19.4714 19.4899 19.6680 20.1168 20.6824 20.9199 20.9781 21.5455 22.1003 22.6180 22.8340 24.5586 25.0889 25.5593 26.3659 26.6971 26.8366 27.5571 27.6481 27.8078 28.8532 31.1349 31.3063 31.9766 32.4189 32.7343 32.9587 33.0367 33.1502 34.0487 34.4057 34.8017 35.6868 39.1887 40.0575 40.8018 40.8074 41.6446 42.6421 44.4543 45.3478 45.8936 47.0631 47.1008 48.0212 48.4948 48.6924 49.7525 49.8006 49.8096 49.9064 50.9373 51.5523 52.2165 53.0692 53.6201 54.1447 54.1653 54.2644 54.7514 56.1125 58.3890 60.5616 61.1438 61.2155 62.5934 63.6846 64.4193 64.4891 65.4795 65.5970 65.7198 66.8310 66.8929 67.6908 68.5262 69.3074 72.7963 72.8453 77.6318 78.1153 80.4294 81.1926 83.6258 85.3285 85.6910 87.8059 350.6198 355.0893 361.3036 363.2916 364.6444 368.5603 373.5070 374.5489 375.0021 378.6567 385.3966 386.0817 electronvolt
chargesum: 2.0000000
charge: -0.298899 -0.163850 -0.200555 -0.142028 -0.276528 0.278367 0.278306 -0.276886 -0.141819 -0.200391 -0.164288 -0.299365 0.926715 0.336866 0.343929 0.353785 0.305841 0.305968 0.353789 0.344065 0.336979
charge: -0.143663 0.002272 -0.089863 0.045928 -0.031351 -0.015637 -0.015235 -0.031839 0.046180 -0.089918 0.002053 -0.143616 0.904269 0.195815 0.197819 0.199753 0.186759 0.186775 0.199781 0.197868 0.195850
qa: -0.2989 -0.1639 -0.2006 -0.1420 -0.2765 0.2784 0.2783 -0.2769 -0.1418 -0.2004 -0.1643 -0.2994 0.9267 0.3369 0.3439 0.3538 0.3058 0.3060 0.3538 0.3441 0.3370
va: 3.6704 3.6592 3.7321 3.6601 3.6439 3.4599 3.4607 3.6440 3.6598 3.7318 3.6594 3.6708 2.8654 0.8613 0.8563 0.8488 0.8837 0.8836 0.8488 0.8562 0.8613
dispersion: -0.015678951 hartree
energy: -2860.780907279958 hartree
dipole: -0.97992 0.92363 -0.05629 23.63604 -22.26405 1.37199 -7.22270 6.79376 -0.42894
magnitude: 1.43858 au
magnitude: 3.65657 debye
temp: 298.15 k
press: 1.00 atm
zeropoint: 0.16344168 hartree
thermalvibcorrection: 0.00689248 hartree
thermalrotcorrection: 0.00141627 hartree
thermaltrasncorrection: 0.00141627 hartree
thermaltotal: -2860.60774058 hartree
thermalcorr: 0.00972503 hartree
nonthermalcorr: 0.16344168 hartree
totalcorr: 0.17316670 hartree
thermalcorrenthalpy: 0.00094421 hartree
totalenthalpy: -2860.60679637 hartree
vibrat: 0.01122702 hartree
rotat: 0.01501469 hartree
transl: 0.02005797 hartree
total: 0.04629968 hartree
totalentropycorr: -0.04629968 hartree
gibbsenthalpy: -2860.65309605 hartree
gibbsminuselec: 0.12781123 hartree
