program: Orca
programVersion: 5.0.4
elementType: F Se C C C C C C O C C C C C C H H H H H H H H
charge: 1
multiplicity: 1
keywords: Freq RIJCOSX PBEh-3c
frequency: 0.00 0.00 0.00 0.00 0.00 0.00 50.21 94.46 104.88 160.98 211.28 231.61 276.17 321.50 330.59 335.58 412.17 418.49 468.23 468.70 529.76 555.91 616.64 659.24 699.22 700.43 714.42 735.34 751.19 803.55 806.65 847.77 910.61 914.14 935.44 1018.65 1019.21 1062.62 1063.37 1081.76 1087.94 1118.04 1119.84 1187.95 1200.47 1233.00 1235.40 1301.33 1307.61 1352.51 1364.50 1423.19 1454.48 1530.39 1534.74 1545.56 1574.11 1666.46 1689.57 1702.61 1720.26 3269.12 3269.67 3290.39 3290.65 3300.21 3300.44 3311.03 3311.36
frequency: 50.21 94.46 104.88 160.98 211.28 231.61 276.17 321.50 330.59 335.58 412.17 418.49 468.23 468.70 529.76 555.91 616.64 659.24 699.22 700.43 714.42 735.34 751.19 803.55 806.65 847.77 910.61 914.14 935.44 1018.65 1019.21 1062.62 1063.37 1081.76 1087.94 1118.04 1119.84 1187.95 1200.47 1233.00 1235.40 1301.33 1307.61 1352.51 1364.50 1423.19 1454.48 1530.39 1534.74 1545.56 1574.11 1666.46 1689.57 1702.61 1720.26 3269.12 3269.67 3290.39 3290.65 3300.21 3300.44 3311.03 3311.36
formula: C12H8FOSe
InChI: InChI=1/C12H8FOSe/c13-15-11-7-3-1-5-9(11)14-10-6-2-4-8-12(10)15/h1-8H
23 atoms
F  0.28571 2.257195 1.862578
Se 0.282911 1.955334 0.158099
C  1.49182 0.563528 0.05217
C  1.091843 -0.758243 0.269056
C  2.049827 -1.765459 0.264688
C  3.371284 -1.448634 0.029185
C  3.772037 -0.132565 -0.211131
C  2.837494 0.874086 -0.195648
O  -0.175612 -1.148394 0.477838
C  -1.269982 -0.414076 0.222564
C  -1.267164 0.964917 -0.004767
C  -2.457019 1.645447 -0.303445
C  -3.638832 0.947397 -0.360925
C  -3.640497 -0.426281 -0.109445
C  -2.475046 -1.105665 0.177188
H  1.742192 -2.788418 0.435414
H  4.107128 -2.241065 0.021122
H  4.810407 0.095696 -0.402609
H  3.144532 1.898089 -0.370442
H  -2.451354 2.713242 -0.485832
H  -4.56012 1.461387 -0.593416
H  -4.571309 -0.975286 -0.149282
H  -2.480151 -2.17243 0.356641
totalener: -3035.97919831 hartree
nucrepener: 1372.94099508 hartree
electener: -4408.92019339 hartree
oneelecener: -6916.59842033 hartree
twoeener: 2507.67822693 hartree
kineticenergy: 3029.66637978 hartree
exchangeener: -94.802178499773 hartree
correlationener: -6.404812205524 hartree
xcener: -101.206990705297 hartree
energy: -12403.3290 -1606.4403 -1441.6382 -1441.5829 -1441.5605 -687.5237 -537.0853 -291.3000 -291.2964 -290.1472 -290.1429 -289.2640 -289.2602 -288.8798 -288.8748 -288.7001 -288.6977 -288.5800 -288.5764 -229.1858 -171.7596 -171.6399 -171.5139 -69.8719 -69.8161 -69.6987 -69.6057 -69.5632 -40.2159 -38.2411 -31.2186 -31.1993 -29.3749 -28.3823 -27.6476 -27.0803 -25.9479 -24.6451 -23.9259 -23.1210 -22.0894 -22.0195 -20.4412 -20.0389 -19.6660 -19.3380 -19.1811 -18.9366 -18.5952 -18.3565 -18.0692 -18.0586 -17.1906 -16.8785 -16.3506 -16.3031 -15.9697 -15.7863 -15.5849 -15.3039 -14.7311 -13.2029 -12.8066 -12.7150 -11.6565 -6.2363 -4.6473 -4.0225 -3.8953 -3.8469 -2.7803 -1.9861 0.1702 0.5126 0.6724 0.7044 1.1931 1.6359 1.6377 2.1889 2.2463 2.6108 2.9059 2.9110 3.5233 3.6732 4.4391 4.5580 5.1580 5.4418 5.7087 5.9172 6.9323 7.7746 8.0024 8.2181 8.6337 8.6694 8.8963 9.5996 9.9561 10.4505 10.7647 10.9586 11.0975 11.4025 12.0062 12.1314 12.3645 12.4678 12.4957 12.7376 12.9183 12.9322 13.0040 13.0806 13.2013 13.4654 14.2611 14.4436 14.6371 14.9652 14.9866 15.9761 16.4409 16.6042 17.3626 17.6861 18.1990 18.3811 19.8289 20.3407 21.0751 21.6992 22.1596 22.2848 22.3195 22.4905 22.7420 22.8904 23.3460 23.5359 23.8824 24.3789 24.5057 24.8024 25.5897 25.6859 26.0448 26.0964 26.8149 27.0196 27.3640 28.3160 28.6765 29.4788 29.9067 30.1500 30.2844 30.6335 30.7906 31.0103 31.1044 31.3030 31.8709 32.0396 33.1748 34.9241 34.9715 35.2182 35.8412 36.3109 37.1241 37.3124 37.3528 37.5862 37.8358 38.0466 38.6769 39.3299 40.0207 40.6041 41.7905 42.7025 43.9076 44.8956 45.3216 45.9235 47.5894 49.1052 49.1584 49.6053 50.0471 50.2403 51.1235 51.1862 51.6696 52.2404 53.3311 54.3040 54.3463 55.1503 55.2896 55.3905 55.5874 56.1996 56.8438 57.8738 57.9868 58.8434 59.5685 59.6008 59.9630 59.9870 62.5331 63.5171 64.8479 66.1830 67.0152 67.0217 68.1099 68.9400 69.5647 70.0019 70.0554 70.6190 70.6487 71.1879 71.3262 71.5831 71.7956 72.9912 75.0579 77.8691 78.1561 81.6538 84.6559 85.0238 87.4428 88.0433 90.5833 90.7136 91.5572 92.0937 356.3206 356.6999 367.6055 367.8520 368.8449 369.3607 380.0759 380.0894 381.6211 383.0439 391.4123 392.1047 696.7899 883.8598 electronvolt
chargesum: 1.0000000
charge: -0.397480 1.188202 -0.347913 0.477500 -0.305809 -0.197602 -0.209397 -0.231285 -0.446758 0.477404 -0.347236 -0.231038 -0.209365 -0.197351 -0.306092 0.293385 0.287933 0.282876 0.278324 0.277929 0.282571 0.287744 0.293458
charge: -0.300352 1.025289 -0.228060 0.103593 -0.124269 -0.056788 -0.114198 -0.094965 -0.047841 0.103422 -0.227767 -0.095035 -0.114133 -0.057007 -0.124260 0.175224 0.169072 0.167693 0.164306 0.164186 0.167626 0.169046 0.175219
qa: -0.3975 1.1882 -0.3479 0.4775 -0.3058 -0.1976 -0.2094 -0.2313 -0.4468 0.4774 -0.3472 -0.2310 -0.2094 -0.1974 -0.3061 0.2934 0.2879 0.2829 0.2783 0.2779 0.2826 0.2877 0.2935
va: 0.9612 3.1504 3.6590 3.6907 3.7582 3.7767 3.8047 3.7833 2.2517 3.6904 3.6593 3.7834 3.8050 3.7769 3.7580 0.8840 0.8848 0.8872 0.8907 0.8909 0.8873 0.8849 0.8840
dispersion: -0.017110627 hartree
energy: -3035.957723969116 hartree
dipole: -3.10005 3.06239 -0.03765 -21.82942 21.41215 -0.41727 -3.73465 2.86543 -0.86922
magnitude: 0.96492 au
magnitude: 2.45262 debye
temp: 298.15 k
press: 1.00 atm
zeropoint: 0.17314900 hartree
thermalvibcorrection: 0.00860961 hartree
thermalrotcorrection: 0.00141627 hartree
thermaltrasncorrection: 0.00141627 hartree
thermaltotal: -3035.77313282 hartree
thermalcorr: 0.01144215 hartree
nonthermalcorr: 0.17314900 hartree
totalcorr: 0.18459115 hartree
thermalcorrenthalpy: 0.00094421 hartree
totalenthalpy: -3035.77218861 hartree
vibrat: 0.01436058 hartree
rotat: 0.01533241 hartree
transl: 0.02025763 hartree
total: 0.04995063 hartree
totalentropycorr: -0.04995063 hartree
gibbsenthalpy: -3035.82213924 hartree
gibbsminuselec: 0.13558473 hartree
