program: Orca
programVersion: 5.0.4
elementType: F Se F C C C C C C O C C C C C C H H H H H H H H
charge: 0
multiplicity: 1
keywords: SP DSD-BLYP D3BJ def2-QZVPP def2-QZVPP/C def2/J TightSCF
formula: C12H8F2OSe
InChI: InChI=1/C12H8F2OSe/c13-16(14)11-7-3-1-5-9(11)15-10-6-2-4-8-12(10)16/h1-8H
24 atoms
F  -0.043402 -1.715707 -1.235177
Se 0.340942 -1.209042 0.476757
F  0.669868 -0.539342 2.148238
C  1.370376 0.189757 -0.277923
C  0.750449 1.122704 -1.096983
C  1.520842 2.088743 -1.734425
C  2.890452 2.110616 -1.55036
C  3.506684 1.18939 -0.713114
C  2.741691 0.233004 -0.071207
O  -0.58332 1.180208 -1.32743
C  -1.509745 0.745339 -0.439636
C  -1.301888 -0.270959 0.480698
C  -2.292434 -0.618677 1.387349
C  -3.516493 0.022009 1.349468
C  -3.735326 1.024892 0.413407
C  -2.738952 1.394577 -0.469997
H  1.032369 2.817589 -2.367441
H  3.481241 2.862358 -2.056255
H  4.577099 1.213758 -0.564791
H  3.216259 -0.488751 0.580823
H  -2.111244 -1.395457 2.118726
H  -4.293203 -0.255889 2.047795
H  -4.687764 1.53635 0.381311
H  -2.8944 2.192841 -1.183432
totalener: -3135.93842828 hartree
nucrepener: 1583.09874152 hartree
electener: -4719.03716980 hartree
oneelecener: -7499.14871895 hartree
twoeener: 2780.11154915 hartree
kineticenergy: 3132.69282672 hartree
exchangeener: -55.657878277355 hartree
correlationener: -2.898801594248 hartree
xcener: -58.556679871603 hartree
chargesum: -0.0000000
charge: -0.534419 0.779366 -0.548598 0.176847 0.196923 -0.114823 -0.078784 -0.131271 -0.108564 -0.384308 0.187516 0.182159 -0.104906 -0.129079 -0.078632 -0.114238 0.109323 0.097354 0.096764 0.098982 0.100393 0.095327 0.096594 0.110073
charge: -0.220779 0.926087 -0.236401 -0.261593 -0.345686 0.088851 0.080879 0.067998 0.046296 0.605602 -0.345894 -0.262993 0.046403 0.068376 0.080855 0.088878 -0.050570 -0.052862 -0.058627 -0.051376 -0.051006 -0.058621 -0.053122 -0.050694
qa: -0.5344 0.7794 -0.5486 0.1768 0.1969 -0.1148 -0.0788 -0.1313 -0.1086 -0.3843 0.1875 0.1822 -0.1049 -0.1291 -0.0786 -0.1142 0.1093 0.0974 0.0968 0.0990 0.1004 0.0953 0.0966 0.1101
va: 0.6768 3.2507 0.6589 3.4729 3.6558 3.7769 3.8217 3.8332 3.7924 2.0469 3.6585 3.4637 3.7888 3.8375 3.8246 3.7791 0.9889 0.9832 0.9885 0.9832 0.9842 0.9892 0.9837 0.9889
total: -3137.587821597 hartree
dispersion: -0.025506601 hartree
energy: -3137.613328198375 hartree
dipole: -5.67228 5.52083 -0.15145 22.50312 -21.62828 0.87485 -6.74897 6.67973 -0.06924
magnitude: 0.89056 au
magnitude: 2.26361 debye
