program: Orca
programVersion: 5.0.4
elementType: Se P O H H H
charge: 0
multiplicity: 1
keywords: SP DSD-BLYP D3BJ def2-QZVPP def2-QZVPP/C def2/J TightSCF
formula: H3OPSe
InChI: InChI=1/H3OPSe/c1-3-2/h3H,2H2
6 atoms
Se 0.508405 0.285402 -0.082387
P  -1.802946 -0.197952 -0.044113
O  1.207973 -1.127438 0.319399
H  0.40983 1.087305 1.178037
H  -1.794229 -0.59338 1.31285
H  -2.213555 1.127521 0.248829
totalener: -2818.67094261 hartree
nucrepener: 266.09919796 hartree
electener: -3084.77014057 hartree
oneelecener: -4450.39456384 hartree
twoeener: 1365.62442327 hartree
kineticenergy: 2816.59406549 hartree
exchangeener: -36.443692868737 hartree
correlationener: -1.421770544074 hartree
xcener: -37.865463412810 hartree
chargesum: 0.0000000
charge: 0.600954 0.060751 -0.689665 0.003408 0.024857 -0.000305
charge: 0.641375 0.352176 -0.408990 -0.212815 -0.182162 -0.189584
qa: 0.6010 0.0608 -0.6897 0.0034 0.0249 -0.0003
va: 3.4352 2.9744 1.6775 0.9786 1.0069 1.0062
total: -2819.160733267 hartree
dispersion: -0.005579775 hartree
energy: -2819.166313041719 hartree
dipole: -6.97696 5.94249 -1.03447 -1.25461 2.65711 1.40251 3.46203 -3.37113 0.09090
magnitude: 1.74511 au
magnitude: 4.43572 debye
