program: Orca
programVersion: 5.0.4
elementType: Se P H H H
charge: 2
multiplicity: 1
keywords: Freq RIJCOSX PBEh-3c
frequency: 0.00 0.00 0.00 0.00 0.00 0.00 535.33 544.97 581.94 647.32 854.79 1019.64 2378.47 2459.53 2531.83
frequency: 535.33 544.97 581.94 647.32 854.79 1019.64 2378.47 2459.53 2531.83
formula: H3PSe
InChI: InChI=1/H3PSe/c1-2/h2H,1H2
5 atoms
Se 1.340605 -0.747794 0.092511
P  -0.627812 -0.084194 -0.002428
H  1.896517 0.621851 -0.007496
H  -1.637554 -1.070333 0.063518
H  -0.971756 1.28047 -0.146205
totalener: -2742.30707027 hartree
nucrepener: 168.55497078 hartree
electener: -2910.86204105 hartree
oneelecener: -4124.80566151 hartree
twoeener: 1213.94362046 hartree
kineticenergy: 2740.33554220 hartree
exchangeener: -61.290512997497 hartree
correlationener: -2.924928938242 hartree
xcener: -64.215441935739 hartree
energy: -12410.4654 -2131.6914 -1613.7507 -1448.9124 -1448.9039 -1448.8564 -236.4943 -201.7702 -179.0082 -178.9392 -178.8719 -149.8490 -149.7817 -149.7486 -77.0874 -77.0551 -77.0019 -76.9375 -76.9264 -37.1239 -32.4607 -27.4040 -26.1985 -24.4924 -22.8870 -16.7076 -13.2558 -11.7936 -10.8545 -9.6997 -5.8545 -3.0010 -2.6599 -2.1795 -1.0508 -1.0235 0.6901 1.8795 2.3122 3.1787 4.0656 5.0441 5.8425 7.7031 7.7530 8.6502 9.0375 14.8043 15.7770 19.0875 20.1973 70.9557 72.7668 73.2024 74.4134 78.9828 electronvolt
chargesum: 2.0000000
charge: 0.508574 0.428435 0.357700 0.355056 0.350235
charge: 0.621446 0.691581 0.241695 0.223969 0.221309
qa: 0.5086 0.4284 0.3577 0.3551 0.3502
va: 2.8367 3.6093 0.8578 0.8693 0.8710
dispersion: -0.001652858 hartree
energy: -2742.301567399217 hartree
dipole: -7.55239 5.35798 -2.19440 4.04430 -2.74417 1.30013 -0.50541 0.34721 -0.15820
magnitude: 2.55553 au
magnitude: 6.49565 debye
temp: 298.15 k
press: 1.00 atm
zeropoint: 0.02632155 hartree
thermalvibcorrection: 0.00079650 hartree
thermalrotcorrection: 0.00141627 hartree
thermaltrasncorrection: 0.00141627 hartree
thermaltotal: -2742.27161680 hartree
thermalcorr: 0.00362905 hartree
nonthermalcorr: 0.02632155 hartree
totalcorr: 0.02995060 hartree
thermalcorrenthalpy: 0.00094421 hartree
totalenthalpy: -2742.27067259 hartree
vibrat: 0.00106600 hartree
rotat: 0.01071670 hartree
transl: 0.01904381 hartree
total: 0.03082651 hartree
totalentropycorr: -0.03082651 hartree
gibbsenthalpy: -2742.30149910 hartree
gibbsminuselec: 0.00006830 hartree
