program: Orca
programVersion: 5.0.4
elementType: P Se F F P H H H H
charge: 0
multiplicity: 1
keywords: SP DSD-BLYP D3BJ def2-QZVPP def2-QZVPP/C def2/J TightSCF
formula: H4F2P2Se
InChI: InChI=1/F2H2PSe.H2P/c1-4(2)3;/h3H2;1H2
9 atoms
P  1.328404 -1.664016 -0.361951
Se 0.183762 0.445864 -0.143474
F  0.818063 0.535082 1.485333
F  -0.86528 1.807837 0.479405
P  -1.747852 -0.746896 -0.531097
H  2.588415 -1.163899 0.037267
H  1.019973 -2.187993 0.914776
H  -1.60089 -1.717934 0.485848
H  -2.623525 0.067382 0.211885
totalener: -3284.64837199 hartree
nucrepener: 620.58534679 hartree
electener: -3905.23371878 hartree
oneelecener: -5805.62125030 hartree
twoeener: 1900.38753153 hartree
kineticenergy: 3282.12275615 hartree
exchangeener: -47.288239175508 hartree
correlationener: -1.982878942021 hartree
xcener: -49.271118117529 hartree
chargesum: -0.0000000
charge: -0.072559 0.811552 -0.413484 -0.521263 0.061464 0.017305 0.014485 0.027008 0.075492
charge: 0.288855 0.442956 -0.120755 -0.265342 0.377108 -0.191773 -0.191424 -0.171448 -0.168177
qa: -0.0726 0.8116 -0.4135 -0.5213 0.0615 0.0173 0.0145 0.0270 0.0755
va: 3.0450 3.3810 0.8218 0.6734 3.0516 1.0125 1.0117 0.9988 1.0071
total: -3285.374889109 hartree
dispersion: -0.011258267 hartree
energy: -3285.386147376679 hartree
dipole: -2.04986 1.83944 -0.21041 -9.29671 8.25186 -1.04485 2.00123 -2.45051 -0.44927
magnitude: 1.15664 au
magnitude: 2.93996 debye
