program: Orca
programVersion: 5.0.4
elementType: F Se F P C C P C C H H H H H H H H H H H H
charge: 0
multiplicity: 1
keywords: Freq RIJCOSX PBEh-3c
frequency: 0.00 0.00 0.00 0.00 0.00 0.00 43.97 47.54 75.67 165.89 183.61 205.74 207.17 207.83 219.81 228.40 228.53 241.60 246.72 259.39 263.22 290.29 290.52 386.06 407.00 542.38 561.83 697.89 699.84 737.91 739.41 880.11 881.69 916.39 917.71 948.39 963.70 1020.61 1024.94 1380.62 1380.76 1398.73 1399.88 1509.23 1509.65 1514.61 1514.83 1521.52 1521.88 1531.52 1532.36 3121.77 3121.98 3123.79 3124.07 3209.06 3209.68 3215.90 3216.27 3240.60 3241.32 3249.31 3249.69
frequency: 43.97 47.54 75.67 165.89 183.61 205.74 207.17 207.83 219.81 228.40 228.53 241.60 246.72 259.39 263.22 290.29 290.52 386.06 407.00 542.38 561.83 697.89 699.84 737.91 739.41 880.11 881.69 916.39 917.71 948.39 963.70 1020.61 1024.94 1380.62 1380.76 1398.73 1399.88 1509.23 1509.65 1514.61 1514.83 1521.52 1521.88 1531.52 1532.36 3121.77 3121.98 3123.79 3124.07 3209.06 3209.68 3215.90 3216.27 3240.60 3241.32 3249.31 3249.69
formula: C4H12F2P2Se
InChI: InChI=1/C4H12F2P2Se/c1-7(2)9(5,6)8(3)4/h1-4H3
21 atoms
F  0.374914 -0.919217 -1.813592
Se 0.026121 -1.021985 0.007875
F  -0.328004 -0.923149 1.828361
P  1.562794 0.617048 0.567352
C  2.790485 -0.471908 1.411649
C  2.416209 0.905525 -1.034021
P  -1.588391 0.535756 -0.563467
C  -2.464229 0.784792 1.032283
C  -2.75756 -0.610426 -1.414193
H  3.61669 0.153797 1.752787
H  2.331298 -0.922471 2.289055
H  3.196187 -1.253779 0.770227
H  3.243267 1.589208 -0.831483
H  1.743073 1.398251 -1.732099
H  2.810869 0.005859 -1.500452
H  -1.819004 1.307818 1.734505
H  -2.82003 -0.132193 1.496315
H  -3.320843 1.429024 0.823516
H  -2.273722 -1.035767 -2.29085
H  -3.128673 -1.41246 -0.776689
H  -3.611251 -0.023724 -1.757179
totalener: -3441.00624139 hartree
nucrepener: 1146.01008479 hartree
electener: -4587.01632618 hartree
oneelecener: -7065.33155952 hartree
twoeener: 2478.31523334 hartree
kineticenergy: 3435.65284669 hartree
exchangeener: -98.950191109428 hartree
correlationener: -6.044883790238 hartree
xcener: -104.995074899667 hartree
energy: -12397.3633 -2116.1495 -2116.1483 -1600.4223 -1435.6252 -1435.5466 -1435.5429 -680.7367 -680.7330 -284.3098 -284.3097 -284.1295 -284.1284 -223.1450 -186.0849 -186.0844 -165.7445 -165.5368 -165.4804 -134.1387 -134.1380 -134.1108 -134.1106 -134.0576 -134.0574 -63.8472 -63.7388 -63.6896 -63.5079 -63.4983 -33.3085 -33.1146 -23.5580 -23.0917 -21.4150 -21.3765 -21.3618 -17.1214 -16.4805 -14.4152 -14.0700 -13.7388 -13.5305 -13.4261 -13.0511 -12.8603 -12.7560 -12.7203 -12.2728 -11.9040 -11.5482 -11.4587 -10.8504 -10.7673 -10.3522 -9.4039 -9.3055 -8.0666 -7.6591 -0.5541 0.3343 1.4453 1.6964 3.1911 3.3338 3.8886 3.9056 4.4020 4.4251 5.0526 5.1718 5.3841 5.4185 5.8045 6.0921 6.2571 6.5452 6.7076 9.6560 10.0577 10.1034 10.9007 11.5016 11.7736 11.8036 12.0102 12.5151 12.9938 13.1103 13.2114 13.8487 13.8962 15.8747 16.3168 16.7982 17.1181 17.6281 18.2227 18.2775 18.3694 18.6643 18.9464 19.4691 19.7828 19.9443 20.3751 21.1512 22.1933 22.2221 22.7568 23.1989 25.3991 25.7513 26.7555 26.8871 27.2852 27.4197 27.5479 27.6804 28.0168 28.4873 28.4946 28.7134 28.9060 29.0608 29.5948 30.5942 30.6816 31.1466 33.9848 34.2565 35.2121 35.2707 35.9212 36.2484 36.2734 36.5793 36.7224 37.0350 37.6373 38.3045 38.3851 38.8761 40.2502 43.1822 44.5711 45.1112 46.3977 47.7226 47.7264 48.5387 48.5965 48.6412 50.4276 50.4309 51.4610 51.6268 58.5653 58.6018 61.0194 61.0608 62.4716 62.6588 63.0827 63.1023 63.5404 63.5988 63.9549 64.1417 67.8086 78.9904 88.2012 91.1665 91.7645 95.2213 99.1723 373.2130 373.2301 374.4563 374.8930 885.6840 894.3851 electronvolt
chargesum: -0.0000000
charge: -0.524357 0.676521 -0.524317 0.350628 -0.867150 -0.859088 0.350147 -0.858855 -0.866762 0.251880 0.280306 0.250407 0.238126 0.277270 0.263771 0.277546 0.263338 0.238101 0.280535 0.250306 0.251644
charge: -0.458888 0.559563 -0.458824 0.357878 -0.532136 -0.532346 0.357556 -0.532212 -0.532030 0.146339 0.157023 0.138137 0.142098 0.156349 0.145733 0.156509 0.145534 0.142101 0.157140 0.138105 0.146374
qa: -0.5244 0.6765 -0.5243 0.3506 -0.8671 -0.8591 0.3501 -0.8589 -0.8668 0.2519 0.2803 0.2504 0.2381 0.2773 0.2638 0.2775 0.2633 0.2381 0.2805 0.2503 0.2516
va: 0.8095 3.1252 0.8094 3.0012 3.6810 3.6948 3.0018 3.6950 3.6812 0.8994 0.8941 0.8971 0.9017 0.8942 0.8976 0.8942 0.8976 0.9017 0.8941 0.8972 0.8994
dispersion: -0.012919043 hartree
energy: -3440.989014777747 hartree
dipole: -0.29772 0.28963 -0.00808 11.42661 -11.15283 0.27378 -0.10854 0.10266 -0.00587
magnitude: 0.27396 au
magnitude: 0.69635 debye
temp: 298.15 k
press: 1.00 atm
zeropoint: 0.16350589 hartree
thermalvibcorrection: 0.01154856 hartree
thermalrotcorrection: 0.00141627 hartree
thermaltrasncorrection: 0.00141627 hartree
thermaltotal: -3440.81112778 hartree
thermalcorr: 0.01438111 hartree
nonthermalcorr: 0.16350589 hartree
totalcorr: 0.17788700 hartree
thermalcorrenthalpy: 0.00094421 hartree
totalenthalpy: -3440.81018357 hartree
vibrat: 0.02023393 hartree
rotat: 0.01462794 hartree
transl: 0.02010549 hartree
total: 0.05496736 hartree
totalentropycorr: -0.05496736 hartree
gibbsenthalpy: -3440.86515093 hartree
gibbsminuselec: 0.12386385 hartree
