program: Orca
programVersion: 5.0.4
elementType: Se P C C C C O H H H H H H H H H H H
charge: 0
multiplicity: 1
keywords: SP DSD-BLYP D3BJ def2-QZVPP def2-QZVPP/C def2/J TightSCF
formula: C4H11OPSe
InChI: InChI=1/C4H11OPSe/c1-3-6(4-2)7-5/h7H,3-4H2,1-2H3
18 atoms
Se -0.360312 1.071443 -0.399691
P  0.317223 -1.17417 -0.401464
C  1.724908 -0.974974 0.78702
C  3.027102 -0.577712 0.105795
C  -1.002752 -1.719347 0.786873
C  -2.360621 -1.893381 0.118917
O  -0.156065 1.600941 1.13711
H  0.885045 1.41542 -1.152558
H  1.447799 -0.254924 1.56194
H  1.840725 -1.944389 1.280245
H  3.317971 -1.295756 -0.660973
H  2.957669 0.402582 -0.367032
H  3.836655 -0.520493 0.833193
H  -1.05831 -1.021963 1.627203
H  -0.664261 -2.674672 1.197143
H  -3.095268 -2.267991 0.831289
H  -2.310923 -2.598645 -0.710636
H  -2.748993 -0.952742 -0.274006
totalener: -2975.43303081 hartree
nucrepener: 680.91954955 hartree
electener: -3656.35258036 hartree
oneelecener: -5487.63016974 hartree
twoeener: 1831.27758938 hartree
kineticenergy: 2972.92187592 hartree
exchangeener: -43.777320654977 hartree
correlationener: -1.982210759462 hartree
xcener: -45.759531414439 hartree
chargesum: 0.0000000
charge: 0.560378 0.160104 -0.160885 -0.167829 -0.181265 -0.160997 -0.715246 0.004711 0.109570 0.048143 0.065710 0.051577 0.060874 0.096115 0.051166 0.063288 0.067885 0.046700
charge: 0.687995 0.373456 -0.066417 0.190143 -0.072853 0.188304 -0.412531 -0.207161 -0.071803 -0.070437 -0.066583 -0.069711 -0.063022 -0.069439 -0.070771 -0.063756 -0.065442 -0.069971
qa: 0.5604 0.1601 -0.1609 -0.1678 -0.1813 -0.1610 -0.7152 0.0047 0.1096 0.0481 0.0657 0.0516 0.0609 0.0961 0.0512 0.0633 0.0679 0.0467
va: 3.3872 3.0409 3.8290 3.9252 3.8339 3.9076 1.6596 0.9849 0.9913 1.0018 0.9954 0.9964 1.0008 0.9924 1.0044 0.9991 0.9981 1.0075
total: -2976.295066896 hartree
dispersion: -0.015519117 hartree
energy: -2976.310586012761 hartree
dipole: 7.55651 -7.35461 0.20190 -20.93896 19.87640 -1.06256 8.39556 -9.07684 -0.68128
magnitude: 1.27826 au
magnitude: 3.24908 debye
