program: Orca
programVersion: 5.0.4
elementType: Se P C C C C H H H H H H H H H H H
charge: 2
multiplicity: 1
keywords: Opt RIJCOSX PBEh-3c
formula: C4H11PSe
InChI: InChI=1/C4H11PSe/c1-3-5(6)4-2/h6H,3-4H2,1-2H3
17 atoms
Se 0.344083 2.421787 0.806945
P  0.041518 0.601657 -0.193898
C  -1.491231 0.164701 -1.017247
C  -2.314148 -0.763064 -0.081385
C  1.390286 -0.567986 -0.055072
C  2.572951 -0.127543 0.800865
H  -0.950399 2.973603 0.38383
H  -1.202811 -0.357392 -1.938358
H  -2.037866 1.070849 -1.287969
H  -1.807877 -1.698997 0.144185
H  -3.219079 -1.010875 -0.639502
H  -2.617208 -0.271498 0.839873
H  0.925713 -1.500438 0.304489
H  1.67971 -0.778062 -1.099287
H  3.078286 0.75257 0.404471
H  2.303915 0.026394 1.844934
H  3.304156 -0.935807 0.782926
totalener: -2899.37549963 hartree
nucrepener: 540.90724526 hartree
electener: -3440.28274489 hartree
oneelecener: -5070.29379398 hartree
twoeener: 1630.01104909 hartree
kineticenergy: 2895.91900318 hartree
exchangeener: -74.435287695614 hartree
correlationener: -4.291319716263 hartree
xcener: -78.726607411877 hartree
dispersion: -0.008959070 hartree
dispersion: -0.008962010 hartree
dispersion: -0.008964377 hartree
dispersion: -0.008959610 hartree
dispersion: -0.008961637 hartree
energy: -12407.5020 -2129.4087 -1610.8116 -1445.9769 -1445.9532 -1445.9327 -295.1591 -295.1017 -293.0854 -292.7675 -233.5594 -199.2908 -176.0926 -175.9837 -175.9573 -147.3890 -147.3129 -147.2662 -74.1661 -74.1219 -74.0899 -74.0030 -73.9893 -35.4135 -33.3151 -33.2032 -29.8815 -28.7880 -27.0240 -24.4449 -24.2066 -23.9184 -22.8663 -22.4178 -21.8705 -21.4952 -20.6995 -20.4445 -20.3641 -20.0611 -19.9395 -13.8271 -10.8059 -9.3719 -8.2043 -7.4043 -5.5318 -5.1959 -4.2954 -3.7422 -3.4720 -3.4447 -2.7145 -2.6888 -2.3797 -2.3039 -1.7467 -1.6227 -1.4233 0.0217 0.8433 1.5446 1.9254 2.2381 2.6541 3.7376 4.2388 4.4061 5.3376 5.5394 6.0119 6.1232 6.5380 6.8821 7.8932 8.1918 8.7425 9.3326 9.6136 10.7341 11.1452 11.7553 12.2931 12.8044 13.6187 14.2300 14.9891 17.4205 17.7398 17.8823 19.3723 19.5056 19.7988 20.2309 20.4703 20.5950 21.2397 21.4563 21.7000 22.7997 24.6596 30.0125 31.8221 33.4618 34.6824 35.8428 36.7038 43.2362 44.1919 44.3443 44.5804 45.9247 46.2160 51.8039 53.1811 53.4993 53.8037 55.2983 56.1290 56.3298 56.6049 61.1394 61.7933 73.8619 76.0070 77.2955 78.1058 82.9352 361.2210 362.7001 368.4180 369.8264 electronvolt
chargesum: 2.0000000
charge: 0.327266 0.733074 -0.690489 -0.679113 -0.704411 -0.690684 0.305110 0.381746 0.367742 0.287841 0.366005 0.290496 0.381214 0.386149 0.286414 0.286995 0.364645
charge: 0.399096 0.900810 -0.365974 -0.348787 -0.369964 -0.370547 0.200583 0.218586 0.205443 0.165541 0.209676 0.166883 0.222219 0.226556 0.166545 0.166595 0.206740
qa: 0.3273 0.7331 -0.6905 -0.6791 -0.7044 -0.6907 0.3051 0.3817 0.3677 0.2878 0.3660 0.2905 0.3812 0.3861 0.2864 0.2870 0.3646
va: 2.7386 3.8544 3.5443 3.5369 3.5690 3.5584 0.8910 0.8214 0.8338 0.8830 0.8470 0.8810 0.8203 0.8158 0.8826 0.8824 0.8494
dispersion: -0.008961717 hartree
energy: -2899.362454704046 hartree
dipole: -3.93490 3.16858 -0.76631 -26.09348 24.50747 -1.58601 -8.10144 6.95520 -1.14624
magnitude: 2.10156 au
magnitude: 5.34174 debye
