program: Orca
programVersion: 5.0.4
elementType: Se P C C C C H H H H H H H H H H H
charge: 2
multiplicity: 1
keywords: SP DSD-BLYP D3BJ def2-QZVPP def2-QZVPP/C def2/J TightSCF
formula: C4H11PSe
InChI: InChI=1/C4H11PSe/c1-3-5(6)4-2/h6H,3-4H2,1-2H3
17 atoms
Se 0.1678 1.282715 0.49221
P  -0.134764 -0.537415 -0.508633
C  -1.667513 -0.974371 -1.331982
C  -2.49043 -1.902137 -0.39612
C  1.214004 -1.707058 -0.369807
C  2.396669 -1.266615 0.48613
H  -1.126681 1.834531 0.069095
H  -1.379093 -1.496464 -2.253093
H  -2.214148 -0.068223 -1.602704
H  -1.984159 -2.838069 -0.170549
H  -3.395361 -2.149947 -0.954236
H  -2.79349 -1.41057 0.525138
H  0.749431 -2.63951 -0.010246
H  1.503428 -1.917135 -1.414022
H  2.902004 -0.386502 0.089736
H  2.127633 -1.112679 1.5302
H  3.127874 -2.074879 0.468191
totalener: -2899.70437383 hartree
nucrepener: 541.00580188 hartree
electener: -3440.71017571 hartree
oneelecener: -5071.75460082 hartree
twoeener: 1631.04442511 hartree
kineticenergy: 2897.34179613 hartree
exchangeener: -41.041847109512 hartree
correlationener: -1.789187959552 hartree
xcener: -42.831035069064 hartree
chargesum: 2.0000000
charge: 0.455330 0.577173 -0.085075 -0.114967 -0.098099 -0.109767 0.158643 0.144788 0.131809 0.090121 0.144979 0.097851 0.148419 0.147277 0.083721 0.088253 0.139544
charge: 1.059028 0.702209 0.052300 0.294122 0.034307 0.266358 -0.143976 -0.013730 -0.025525 -0.044474 -0.014923 -0.044852 -0.007945 -0.004955 -0.045107 -0.045540 -0.017297
qa: 0.4553 0.5772 -0.0851 -0.1150 -0.0981 -0.1098 0.1586 0.1448 0.1318 0.0901 0.1450 0.0979 0.1484 0.1473 0.0837 0.0883 0.1395
va: 2.8251 4.1175 3.8556 3.8615 3.8597 3.8619 0.9942 0.9849 0.9875 0.9968 0.9902 0.9938 0.9844 0.9821 0.9893 0.9894 0.9986
total: -2900.412863444 hartree
dispersion: -0.013739002 hartree
energy: -2900.426602445811 hartree
dipole: -3.93490 3.20325 -0.73165 -26.09348 24.49818 -1.59530 -8.10144 6.97495 -1.12649
magnitude: 2.08549 au
magnitude: 5.30090 debye
