program: Orca
programVersion: 5.0.4
elementType: C C P C C Se F P C C C C H H H H H H H H H H H H H H H H H H H H
charge: 1
multiplicity: 1
keywords: Opt RIJCOSX PBEh-3c
formula: C8H20FP2Se
InChI: InChI=1/C8H20FP2Se/c1-5-10(6-2)12(9)11(7-3)8-4/h5-8H2,1-4H3
32 atoms
C  -2.924424 -1.300469 1.745651
C  -1.778105 -1.128903 0.745607
P  -1.330338 0.668815 0.697337
C  -2.779183 1.444859 -0.14823
C  -3.454112 0.707078 -1.293011
Se 0.107057 0.624589 -1.14195
F  0.738472 2.217462 -0.862482
P  1.66157 -0.876035 -0.407349
C  2.852243 -0.79114 -1.816892
C  3.565716 0.523935 -2.093314
C  2.521572 0.007413 0.973251
C  1.858435 -0.192607 2.329003
H  -3.841324 -0.813871 1.4144
H  -3.14645 -2.360044 1.861924
H  -2.670351 -0.910895 2.731533
H  -2.06034 -1.530633 -0.228589
H  -0.901944 -1.682886 1.086259
H  -2.469794 2.451042 -0.442748
H  -3.489388 1.60864 0.670596
H  -2.788342 0.548465 -2.142027
H  -4.298344 1.290113 -1.658715
H  -3.845703 -0.261884 -0.986729
H  2.327915 -1.157825 -2.70241
H  3.577438 -1.576537 -1.575705
H  4.281666 0.387503 -2.902526
H  2.87982 1.312656 -2.400597
H  4.122594 0.881458 -1.228987
H  2.66853 1.063483 0.745405
H  3.518303 -0.446516 0.971107
H  0.894911 0.311159 2.391642
H  2.489241 0.229339 3.110054
H  1.712659 -1.247565 2.558294
totalener: -3498.01269834 hartree
nucrepener: 1498.86333099 hartree
electener: -4996.87602933 hartree
oneelecener: -7815.18062255 hartree
twoeener: 2818.30459322 hartree
kineticenergy: 3491.83258630 hartree
exchangeener: -106.265670666885 hartree
correlationener: -6.936881869857 hartree
xcener: -113.202552536742 hartree
dispersion: -0.021504188 hartree
dispersion: -0.021539069 hartree
dispersion: -0.021490676 hartree
dispersion: -0.021533329 hartree
dispersion: -0.021523602 hartree
dispersion: -0.021395220 hartree
dispersion: -0.021503421 hartree
dispersion: -0.021515759 hartree
dispersion: -0.021511608 hartree
energy: -12402.2829 -2120.5867 -2120.4912 -1605.4313 -1440.6305 -1440.5609 -1440.5555 -687.5123 -288.5168 -288.4823 -288.4567 -288.3720 -287.5403 -287.4861 -287.4310 -287.3956 -228.1517 -190.5341 -190.4164 -170.7777 -170.5515 -170.4759 -138.6090 -138.5439 -138.5053 -138.4875 -138.4247 -138.3794 -68.8620 -68.7753 -68.7066 -68.5018 -68.4927 -40.0441 -28.4997 -27.9810 -26.9786 -26.8939 -26.6799 -24.1051 -23.6610 -22.9657 -22.8745 -20.9906 -20.5758 -18.9352 -18.8137 -18.6190 -18.1628 -17.7789 -17.6840 -17.5911 -17.3681 -16.6626 -16.4716 -16.3474 -16.0562 -15.6985 -15.5600 -15.5187 -15.1291 -14.9612 -14.8876 -14.7666 -14.2776 -14.1866 -13.8305 -13.6568 -12.4688 -11.9028 -5.9833 -4.5690 -4.3042 -2.7273 -1.3668 -1.0377 -0.5527 -0.0349 0.1659 0.7186 0.8603 1.1067 1.1624 1.3974 1.4509 1.7785 1.8472 1.9267 2.1684 2.2939 2.4052 2.4999 2.5956 2.7502 2.9042 3.1629 3.3855 3.4903 3.6344 3.8316 4.0145 5.5361 6.3106 6.4828 6.9501 7.2715 7.4323 8.3225 8.6159 9.2460 9.3070 9.3901 9.4958 9.7360 9.9635 10.5830 11.1197 11.3307 11.4603 11.6714 11.9839 12.1321 12.5898 12.8078 12.9834 13.5984 13.9470 14.0920 14.6015 14.8938 15.0169 15.2874 15.5969 15.7250 16.4475 16.9149 17.0271 17.1941 17.9640 18.4224 18.5370 18.8759 19.1927 19.4329 19.8023 20.4304 22.0489 22.1089 22.9823 23.2711 23.6153 23.6968 23.7858 23.8690 24.1592 24.4713 24.6732 24.7984 24.9207 25.0983 25.4214 25.5828 25.8261 26.0064 26.3554 26.4886 26.7556 26.8551 27.2720 27.5643 27.8658 28.5961 29.4150 29.7548 30.3626 30.6223 30.9079 31.3331 31.5038 31.8305 32.5702 35.2902 36.0731 36.3873 37.0906 37.3557 38.8768 39.4036 39.8055 40.1770 40.7570 41.3238 41.3896 42.2361 42.4578 43.0171 49.6889 50.1913 50.3573 50.5411 50.7876 50.9497 51.0224 51.2521 51.3894 51.6366 52.2902 52.4416 57.5399 57.9250 59.1124 59.1741 60.4041 60.5458 60.6320 61.1614 61.6989 61.9057 62.0718 62.1689 62.2074 62.3012 62.5198 62.6156 67.3850 67.5761 67.9316 68.2168 68.6250 83.6182 83.9506 84.0593 88.7689 90.0851 367.8352 368.2843 368.3703 368.7020 375.3042 375.5800 375.7720 376.0912 883.8572 electronvolt
chargesum: 1.0000000
charge: -0.667813 -0.680440 0.393166 -0.688203 -0.649772 0.602010 -0.410384 0.360741 -0.674636 -0.644273 -0.672686 -0.658767 0.242871 0.283229 0.252088 0.275888 0.293703 0.295396 0.300081 0.227021 0.281436 0.240311 0.287504 0.296705 0.276843 0.235507 0.243051 0.299310 0.289713 0.250586 0.278920 0.240896
charge: -0.368446 -0.398249 0.409486 -0.404407 -0.372356 0.579714 -0.313180 0.392041 -0.396795 -0.371011 -0.386050 -0.373731 0.137497 0.159241 0.144361 0.146032 0.153442 0.161119 0.168212 0.129580 0.158415 0.137136 0.158181 0.166221 0.156464 0.134733 0.139199 0.158210 0.164212 0.134753 0.156413 0.139562
qa: -0.6678 -0.6804 0.3932 -0.6882 -0.6498 0.6020 -0.4104 0.3607 -0.6746 -0.6443 -0.6727 -0.6588 0.2429 0.2832 0.2521 0.2759 0.2937 0.2954 0.3001 0.2270 0.2814 0.2403 0.2875 0.2967 0.2768 0.2355 0.2431 0.2993 0.2897 0.2506 0.2789 0.2409
va: 3.6705 3.6741 2.9345 3.6744 3.6723 2.8110 0.9386 3.0301 3.6859 3.6665 3.6739 3.6660 0.9022 0.8909 0.8981 0.8799 0.8739 0.8719 0.8723 0.9082 0.8896 0.9035 0.8762 0.8713 0.8906 0.9090 0.9023 0.8711 0.8735 0.8977 0.8911 0.9038
dispersion: -0.021510364 hartree
energy: -3497.992025700838 hartree
dipole: -3.68303 3.62554 -0.05749 -11.63311 10.83218 -0.80093 15.37972 -15.26726 0.11246
magnitude: 0.81083 au
magnitude: 2.06096 debye
