program: Orca
programVersion: 5.0.4
elementType: C C P C C Se F F P C C C C H H H H H H H H H H H H H H H H H H H H
charge: 0
multiplicity: 1
keywords: Opt RIJCOSX PBEh-3c
formula: C8H20F2P2Se
InChI: InChI=1/C8H20F2P2Se/c1-5-11(6-2)13(9,10)12(7-3)8-4/h5-8H2,1-4H3
33 atoms
C  2.137521 1.578306 -1.761027
C  2.659976 0.400965 -0.947433
P  1.405863 -0.947334 -0.787295
C  2.410411 -2.318942 -0.046356
C  3.353622 -1.996245 1.101837
Se 0.20158 -0.340679 1.105825
F  0.935777 1.365594 1.192489
F  -0.555658 -2.015897 0.833353
P  -1.457026 0.787771 -0.066246
C  -2.206672 1.682119 1.379387
C  -3.267418 2.666729 0.894272
C  -2.736089 -0.5144 -0.358679
C  -2.478693 -1.326902 -1.620354
H  2.927924 2.312729 -1.91828
H  1.778073 1.260705 -2.739857
H  1.318166 2.076772 -1.24858
H  3.037269 0.733499 0.018514
H  3.500284 -0.070298 -1.46981
H  1.69956 -3.096628 0.234665
H  2.973026 -2.725785 -0.893331
H  4.105748 -1.259715 0.821651
H  2.819961 -1.610191 1.970684
H  3.883164 -2.894245 1.422443
H  -2.633315 0.983168 2.102304
H  -1.401054 2.223075 1.876217
H  -2.854263 3.377614 0.178652
H  -3.668631 3.236039 1.732631
H  -4.108181 2.163448 0.416034
H  -3.670868 0.046437 -0.465672
H  -2.858124 -1.161519 0.50961
H  -1.58076 -1.93211 -1.523662
H  -3.313841 -1.999955 -1.81667
H  -2.35733 -0.684323 -2.492616
totalener: -3597.92699063 hartree
nucrepener: 1715.96557721 hartree
electener: -5313.89256783 hartree
oneelecener: -8412.63948749 hartree
twoeener: 3098.74691966 hartree
kineticenergy: 3591.16673299 hartree
exchangeener: -112.083475165433 hartree
correlationener: -7.412254952061 hartree
xcener: -119.495730117494 hartree
dispersion: -0.021993759 hartree
dispersion: -0.022010154 hartree
dispersion: -0.022011614 hartree
dispersion: -0.022003814 hartree
dispersion: -0.021978238 hartree
dispersion: -0.022007414 hartree
dispersion: -0.022028803 hartree
dispersion: -0.021989750 hartree
dispersion: -0.022002053 hartree
dispersion: -0.022008675 hartree
energy: -12397.3206 -2115.9832 -2115.9756 -1600.3698 -1435.5741 -1435.4943 -1435.4906 -680.7781 -680.7600 -284.4677 -284.4340 -284.3080 -284.2945 -284.1049 -284.0099 -283.6298 -283.6172 -223.0880 -185.9058 -185.9016 -165.6910 -165.4791 -165.4201 -133.9628 -133.9595 -133.9306 -133.9244 -133.8783 -133.8731 -63.7921 -63.6855 -63.6328 -63.4463 -63.4377 -33.3155 -33.1262 -24.1341 -23.9825 -23.1177 -23.0924 -21.9698 -20.2104 -19.7064 -19.0017 -18.8898 -16.6835 -16.2798 -14.5470 -14.3490 -14.1948 -14.1043 -13.8804 -13.6277 -13.5186 -13.0401 -12.9001 -12.4168 -12.0629 -11.9451 -11.9283 -11.7484 -11.6321 -11.4964 -11.4844 -11.2345 -11.1920 -10.8097 -10.7872 -10.3045 -9.9268 -9.8598 -9.2675 -9.1764 -7.8389 -7.4954 -0.4386 0.2174 1.2853 1.7836 2.9564 3.1691 3.6068 4.0157 4.2767 4.4458 4.7573 4.8879 5.0274 5.1636 5.2862 5.4321 5.5276 5.6593 5.7811 6.0560 6.1252 6.2476 6.3338 6.4746 6.6275 6.6512 6.8646 7.0547 7.1496 7.2456 7.5401 9.8673 10.2808 10.6709 11.2041 11.3629 11.8208 12.0210 12.3401 12.6431 13.2299 13.6543 13.7148 13.9285 14.0443 14.2331 14.4608 14.9869 15.1607 15.4231 15.7465 16.3525 16.4288 16.7609 17.4973 17.5888 17.6378 18.0917 18.3654 18.7184 19.1049 19.6454 20.1493 20.4790 20.7634 21.0671 21.4583 21.6028 22.0288 22.2781 22.8521 22.8682 23.1634 23.2537 23.7008 24.5594 26.1412 26.5748 26.7496 27.0651 27.2770 27.5086 27.5722 27.6739 27.7590 28.0250 28.0902 28.2419 28.5150 28.6444 29.0191 29.1581 29.2264 29.5257 29.6714 30.1492 30.2967 30.4882 30.5738 30.6894 31.3724 31.9128 33.1251 33.4481 33.6653 34.9107 35.9147 36.0881 36.6860 36.8983 37.1660 37.2795 37.5700 38.1610 38.3712 38.9850 39.0932 39.9490 40.6641 41.1808 42.2139 42.9402 43.3990 43.5836 43.8492 44.4811 44.5469 44.9060 45.4528 46.0687 46.2775 46.8097 49.2083 49.9507 53.6065 54.0759 54.3345 54.4461 54.8276 54.9872 55.1562 55.3955 55.6224 55.7634 56.4951 56.5367 61.4109 61.7701 62.8618 62.9498 64.2942 64.5407 64.9269 65.1238 65.4074 65.5369 65.5519 65.7585 65.8332 66.0283 66.2408 66.4562 67.8658 71.1518 71.4929 72.5082 72.6531 79.4414 88.7376 91.4432 91.8455 95.5941 99.4266 371.6640 371.6886 372.5114 372.5748 379.2164 379.5773 379.9296 380.1956 885.6713 894.6680 electronvolt
chargesum: -0.0000000
charge: -0.639976 -0.656077 0.366163 -0.662523 -0.640857 0.660355 -0.521811 -0.521585 0.368212 -0.651861 -0.652686 -0.652615 -0.642558 0.223168 0.216376 0.256107 0.276372 0.234435 0.282499 0.247809 0.223526 0.232027 0.233394 0.246630 0.278622 0.234046 0.239409 0.216936 0.236810 0.274280 0.255943 0.222802 0.216628
charge: -0.372870 -0.400746 0.366962 -0.404512 -0.372554 0.553698 -0.457861 -0.457546 0.366096 -0.399047 -0.371768 -0.398216 -0.373614 0.128333 0.126567 0.142051 0.146899 0.135843 0.153717 0.141245 0.128015 0.130692 0.133366 0.132768 0.151022 0.134186 0.135805 0.123702 0.135284 0.146101 0.141206 0.128288 0.126890
qa: -0.6400 -0.6561 0.3662 -0.6625 -0.6409 0.6604 -0.5218 -0.5216 0.3682 -0.6519 -0.6527 -0.6526 -0.6426 0.2232 0.2164 0.2561 0.2764 0.2344 0.2825 0.2478 0.2235 0.2320 0.2334 0.2466 0.2786 0.2340 0.2394 0.2169 0.2368 0.2743 0.2559 0.2228 0.2166
va: 3.6994 3.7086 2.9634 3.7041 3.7028 3.1344 0.8170 0.8177 2.9495 3.6879 3.7140 3.7015 3.7007 0.9108 0.9122 0.9089 0.8894 0.8957 0.8881 0.8925 0.9091 0.9081 0.9061 0.8911 0.8895 0.9058 0.9060 0.9120 0.8965 0.8906 0.9088 0.9107 0.9123
dispersion: -0.022006786 hartree
energy: -3597.897167175018 hartree
dipole: -3.07991 3.07421 -0.00570 5.84222 -5.82319 0.01903 -16.87892 16.72227 -0.15665
magnitude: 0.15791 au
magnitude: 0.40136 debye
