program: Orca
programVersion: 5.0.4
elementType: C C P C C Se P C C C C O H H H H H H H H H H H H H H H H H H H H
charge: 0
multiplicity: 1
keywords: Opt RIJCOSX PBEh-3c
formula: C8H20OP2Se
InChI: InChI=1/C8H20OP2Se/c1-5-10(6-2)12(9)11(7-3)8-4/h5-8H2,1-4H3
32 atoms
C  -3.037695 -0.20033 2.287349
C  -1.818677 -0.557804 1.442864
P  -1.583363 0.625716 0.03615
C  -3.021808 0.158158 -1.046622
C  -3.018443 0.903837 -2.37516
Se 0.003817 -0.616288 -1.139156
P  1.663849 -0.159786 0.455921
C  2.700722 -1.637544 0.027604
C  3.904081 -1.745223 0.958197
C  2.559593 1.186345 -0.459445
C  1.857532 2.534149 -0.345294
O  -0.353159 -2.202396 -0.895236
H  -3.968214 -0.29742 1.72812
H  -2.983328 0.819129 2.670506
H  -3.108898 -0.869909 3.144701
H  -0.915462 -0.503679 2.054157
H  -1.885036 -1.578261 1.059829
H  -3.040149 -0.924632 -1.197443
H  -3.926609 0.412827 -0.489068
H  -3.907195 0.658848 -2.956649
H  -2.153812 0.646386 -2.98803
H  -3.006176 1.98382 -2.226227
H  3.025673 -1.60247 -1.015547
H  2.057103 -2.513341 0.130719
H  4.578622 -0.894232 0.856903
H  4.4799 -2.643012 0.732404
H  3.5971 -1.802666 2.00249
H  2.717728 0.911336 -1.505421
H  3.552586 1.248911 -0.004125
H  0.874813 2.525246 -0.817017
H  2.445157 3.317449 -0.824275
H  1.709744 2.816838 0.696801
totalener: -3473.64265603 hartree
nucrepener: 1463.31064471 hartree
electener: -4936.95330074 hartree
oneelecener: -7731.74790456 hartree
twoeener: 2794.79460382 hartree
kineticenergy: 3467.58783296 hartree
exchangeener: -105.387431287517 hartree
correlationener: -6.920205811567 hartree
xcener: -112.307637099084 hartree
dispersion: -0.020993104 hartree
dispersion: -0.020987163 hartree
dispersion: -0.020986642 hartree
dispersion: -0.021009745 hartree
dispersion: -0.020989529 hartree
energy: -12396.6330 -2115.7191 -2115.6326 -1599.7882 -1434.9646 -1434.9419 -1434.9152 -528.9970 -284.5435 -284.3670 -284.3237 -284.1582 -284.0130 -283.9932 -283.9605 -283.9393 -222.5547 -185.6690 -185.5846 -165.0750 -165.0333 -164.9326 -133.7188 -133.6997 -133.6476 -133.6380 -133.6132 -133.5666 -63.1756 -63.1588 -63.0858 -63.0138 -62.9984 -28.4248 -24.0497 -23.9034 -23.2306 -23.1055 -21.0556 -20.1634 -19.2618 -18.9489 -18.8746 -16.5926 -15.9578 -14.3291 -14.0635 -14.0281 -13.8834 -13.6703 -13.5696 -12.9468 -12.9027 -12.0210 -11.9598 -11.8299 -11.8111 -11.4244 -11.3918 -11.2524 -11.1596 -10.9656 -10.7426 -10.4810 -9.8930 -9.7067 -8.4462 -8.2146 -7.3687 -6.8252 -0.1122 0.3482 0.8925 1.5995 2.7039 3.3845 3.7095 3.8272 4.1280 4.4665 4.7417 4.8370 4.9292 5.2154 5.3739 5.4371 5.6189 5.7266 5.9084 5.9597 6.0644 6.1536 6.3298 6.3657 6.5505 6.5518 6.7970 7.0570 7.1234 7.2113 7.3299 10.1591 10.5558 10.8707 11.2421 11.7737 11.8441 11.9988 12.3249 12.7287 13.2907 13.4324 13.5741 13.9073 14.2880 14.4287 15.0099 15.1817 15.2720 15.5094 15.6685 15.9222 16.2008 16.9490 17.1037 17.3711 17.5895 17.7572 18.3303 18.7908 19.4919 19.7620 20.1115 20.7854 20.9055 21.3449 21.8639 21.9384 22.3673 22.4256 22.5742 22.9211 23.0969 23.4243 23.6625 24.4270 26.4007 26.7492 26.9882 27.0357 27.2519 27.4171 27.6347 27.8994 28.0675 28.1605 28.2252 28.3413 28.6634 28.8097 29.0263 29.1011 29.1424 29.3212 29.6516 30.0204 30.3971 30.6517 30.7145 31.1756 31.2174 31.8912 33.1508 33.3207 33.7346 33.9167 34.2111 34.5174 35.0551 40.7277 40.7794 41.1562 41.4593 43.4874 43.5935 43.6566 43.8857 45.3536 45.6699 45.8101 46.0343 52.6759 52.9285 53.8287 53.8452 54.2983 54.4749 54.7581 54.8035 54.8792 55.0705 55.2779 55.4475 55.5433 55.6573 55.8874 57.0787 57.6043 61.2836 61.4457 62.6676 62.8540 64.1738 64.2943 64.4344 64.7162 65.2420 65.3960 65.4775 65.6753 65.7192 65.9231 65.9395 66.0398 68.3298 71.4734 71.5868 72.3840 72.7551 88.9732 89.4593 89.5323 95.0831 96.0801 371.4423 371.6639 372.1450 372.3289 379.2997 379.6221 379.9274 380.0546 696.7211 electronvolt
chargesum: -0.0000000
charge: -0.649408 -0.645799 0.260777 -0.654845 -0.643490 0.519587 0.272593 -0.643853 -0.646104 -0.647005 -0.640520 -0.709893 0.217891 0.223627 0.237847 0.266493 0.281604 0.269882 0.250627 0.234297 0.224543 0.225189 0.241037 0.289018 0.212703 0.237160 0.230816 0.246413 0.248658 0.229117 0.230143 0.230897
charge: -0.370014 -0.397791 0.276487 -0.400353 -0.372731 0.428576 0.291445 -0.397804 -0.370770 -0.398490 -0.373325 -0.608274 0.124147 0.128733 0.134785 0.143918 0.148489 0.142240 0.138556 0.133294 0.127012 0.130301 0.130935 0.156631 0.122299 0.134386 0.132814 0.131160 0.138821 0.129530 0.131075 0.133921
qa: -0.6494 -0.6458 0.2608 -0.6548 -0.6435 0.5196 0.2726 -0.6439 -0.6461 -0.6470 -0.6405 -0.7099 0.2179 0.2236 0.2378 0.2665 0.2816 0.2699 0.2506 0.2343 0.2245 0.2252 0.2410 0.2890 0.2127 0.2372 0.2308 0.2464 0.2487 0.2291 0.2301 0.2309
va: 3.7232 3.6604 2.9414 3.6804 3.7119 3.2600 2.9243 3.6741 3.7217 3.7002 3.7089 1.7823 0.9114 0.9083 0.9056 0.8905 0.8916 0.8866 0.8955 0.9077 0.9107 0.9086 0.8948 0.8875 0.9122 0.9063 0.9075 0.8924 0.8936 0.9106 0.9081 0.9082
dispersion: -0.020989135 hartree
energy: -3473.621718120494 hartree
dipole: 0.04787 0.28712 0.33499 8.96992 -8.05708 0.91284 14.26843 -14.18205 0.08638
magnitude: 0.97620 au
magnitude: 2.48130 debye
