program: Orca
programVersion: 5.0.4
elementType: C Se F F C H H H H H H
charge: 0
multiplicity: 1
keywords: Freq RIJCOSX PBEh-3c
frequency: 0.00 0.00 0.00 0.00 0.00 0.00 132.75 161.99 246.12 263.44 293.40 330.65 394.96 510.26 560.56 622.66 705.27 890.03 915.02 973.83 1030.49 1363.92 1393.95 1503.48 1510.94 1520.19 1527.25 3105.62 3135.08 3203.96 3224.97 3235.51 3272.85
frequency: 132.75 161.99 246.12 263.44 293.40 330.65 394.96 510.26 560.56 622.66 705.27 890.03 915.02 973.83 1030.49 1363.92 1393.95 1503.48 1510.94 1520.19 1527.25 3105.62 3135.08 3203.96 3224.97 3235.51 3272.85
formula: C2H6F2Se
InChI: InChI=1/C2H6F2Se/c1-5(2,3)4/h1-2H3
11 atoms
C  -1.347764 0.1996 -0.207464
Se 0.174401 0.305294 0.98393
F  -1.053733 -0.08261 2.314716
F  0.670512 -1.325908 1.34653
C  1.424709 0.117004 -0.57489
H  -1.117003 0.681337 -1.155476
H  -2.21126 0.655939 0.267548
H  -1.552103 -0.857543 -0.384125
H  2.438849 -0.047115 -0.209319
H  1.41198 1.055583 -1.135491
H  1.161512 -0.701682 -1.246058
totalener: -2679.36311234 hartree
nucrepener: 441.07909734 hartree
electener: -3120.44220968 hartree
oneelecener: -4606.40456705 hartree
twoeener: 1485.96235737 hartree
kineticenergy: 2675.76983309 hartree
exchangeener: -66.608283224859 hartree
correlationener: -3.752744316068 hartree
xcener: -70.361027540926 hartree
energy: -12398.3989 -1601.3974 -1436.5798 -1436.5605 -1436.5180 -682.6925 -680.3720 -285.1918 -284.2487 -224.1331 -166.6807 -166.5840 -166.4632 -64.8003 -64.7355 -64.6357 -64.5461 -64.5173 -35.5139 -32.8006 -24.2776 -21.5923 -19.7480 -15.1164 -14.7566 -14.5300 -14.0193 -13.2464 -12.9984 -12.5441 -12.0951 -11.5581 -10.7678 -10.1526 -8.3198 -0.2758 1.6806 3.0784 3.5510 4.6928 4.9899 5.5199 5.5881 6.0933 9.9506 11.6061 12.2193 12.3999 12.7970 13.9871 14.2241 15.2604 15.7726 17.0023 17.1015 18.5050 18.7999 22.9807 24.2275 26.7875 27.0755 27.7464 28.0947 28.3126 29.3408 30.9365 31.1210 33.2451 33.5371 34.3964 35.0709 35.2765 36.1622 36.3155 36.8142 38.0604 38.6154 39.3219 41.8188 42.7201 44.4956 46.7478 47.8463 48.2407 49.3016 50.0790 52.1447 56.8045 58.7149 62.0568 62.4186 62.8092 63.1700 72.4961 73.5379 89.4297 90.0722 92.3137 94.6154 98.2806 372.4723 374.3329 887.0732 890.6732 electronvolt
chargesum: 0.0000000
charge: -0.822492 1.136971 -0.533349 -0.443158 -0.877924 0.241973 0.288763 0.285492 0.257957 0.217749 0.248019
charge: -0.459647 0.905206 -0.455539 -0.336137 -0.529462 0.141505 0.160390 0.165096 0.142957 0.127946 0.137684
qa: -0.8225 1.1370 -0.5333 -0.4432 -0.8779 0.2420 0.2888 0.2855 0.2580 0.2177 0.2480
va: 3.6955 3.3241 0.8027 0.9027 3.6824 0.8972 0.8895 0.8857 0.9029 0.9087 0.9028
dispersion: -0.004349594 hartree
energy: -2679.335959303723 hartree
dipole: -0.98099 1.10729 0.12630 -1.01171 1.64393 0.63222 -11.20584 9.79757 -1.40827
magnitude: 1.54883 au
magnitude: 3.93681 debye
temp: 298.15 k
press: 1.00 atm
zeropoint: 0.08208049 hartree
thermalvibcorrection: 0.00425597 hartree
thermalrotcorrection: 0.00141627 hartree
thermaltrasncorrection: 0.00141627 hartree
thermaltotal: -2679.24679030 hartree
thermalcorr: 0.00708852 hartree
nonthermalcorr: 0.08208049 hartree
totalcorr: 0.08916900 hartree
thermalcorrenthalpy: 0.00094421 hartree
totalenthalpy: -2679.24584609 hartree
vibrat: 0.00706044 hartree
rotat: 0.01265277 hartree
transl: 0.01941713 hartree
total: 0.03913034 hartree
totalentropycorr: -0.03913034 hartree
gibbsenthalpy: -2679.28497643 hartree
gibbsminuselec: 0.05098288 hartree
