program: Orca
programVersion: 5.0.4
elementType: C Se C O H H H H H H
charge: 0
multiplicity: 1
keywords: Freq RIJCOSX PBEh-3c
frequency: 0.00 0.00 0.00 0.00 0.00 0.00 154.04 189.06 238.18 253.39 288.47 574.64 577.98 890.07 925.74 944.54 967.16 1006.43 1362.21 1382.11 1496.63 1508.49 1508.73 1524.74 3121.64 3122.51 3231.29 3233.32 3236.90 3237.27
frequency: 154.04 189.06 238.18 253.39 288.47 574.64 577.98 890.07 925.74 944.54 967.16 1006.43 1362.21 1382.11 1496.63 1508.49 1508.73 1524.74 3121.64 3122.51 3231.29 3233.32 3236.90 3237.27
formula: C2H6OSe
InChI: InChI=1/C2H6OSe/c1-4(2)3/h1-2H3
10 atoms
C  -1.407364 -0.090648 0.336042
Se -0.084196 0.962097 -0.655669
C  1.444191 0.026226 0.14285
O  -0.170207 0.398556 -2.178131
H  -1.268521 -1.145637 0.100529
H  -2.400395 0.217013 0.009929
H  -1.316265 0.071372 1.410317
H  1.484319 0.187911 1.220407
H  1.361764 -1.038369 -0.075173
H  2.356672 0.411578 -0.311001
totalener: -2555.11688061 hartree
nucrepener: 299.90401342 hartree
electener: -2855.02089404 hartree
oneelecener: -4149.59151740 hartree
twoeener: 1294.57062336 hartree
kineticenergy: 2552.29621365 hartree
exchangeener: -59.923406090432 hartree
correlationener: -3.260843634781 hartree
xcener: -63.184249725213 hartree
energy: -12397.0031 -1600.1703 -1435.3406 -1435.3365 -1435.2904 -528.8195 -284.7764 -284.7742 -222.9637 -165.4817 -165.4750 -165.3150 -63.6088 -63.6030 -63.4688 -63.4325 -63.3912 -28.6903 -23.2930 -21.7106 -18.3510 -13.9801 -13.7947 -13.5240 -13.0660 -11.8907 -11.7790 -10.4996 -8.1986 -7.4264 1.2178 1.6670 2.9056 3.5240 4.3907 5.2565 5.3152 5.5894 6.0171 10.1661 11.4968 12.0314 13.2044 13.2759 14.2404 14.5804 15.8675 15.9493 17.4909 18.0262 18.4576 18.7837 23.3867 24.4137 26.7647 26.7849 27.8684 28.2109 28.3209 29.7406 31.2485 32.1783 32.8072 33.9309 35.7007 46.4519 46.8980 47.2622 49.0407 52.7278 52.8296 54.5621 56.5967 57.0696 58.6930 58.9291 61.5879 62.3542 62.5042 63.2705 68.7432 88.5506 89.4863 90.0868 94.8248 96.4802 372.0366 373.5588 696.4057 electronvolt
chargesum: 0.0000000
charge: -0.841341 0.854103 -0.841744 -0.709064 0.266159 0.267079 0.235895 0.235981 0.266019 0.266913
charge: -0.495872 0.717548 -0.496145 -0.604236 0.149861 0.150350 0.139230 0.139325 0.149736 0.150201
qa: -0.8413 0.8541 -0.8417 -0.7091 0.2662 0.2671 0.2359 0.2360 0.2660 0.2669
va: 3.6708 3.4135 3.6703 1.7867 0.8944 0.8952 0.9027 0.9026 0.8945 0.8953
dispersion: -0.003888396 hartree
energy: -2555.100744083715 hartree
dipole: 0.74429 -0.62675 0.11754 -8.12661 8.08766 -0.03895 6.00708 -4.36050 1.64659
magnitude: 1.65124 au
magnitude: 4.19711 debye
temp: 298.15 k
press: 1.00 atm
zeropoint: 0.07968016 hartree
thermalvibcorrection: 0.00324531 hartree
thermalrotcorrection: 0.00141627 hartree
thermaltrasncorrection: 0.00141627 hartree
thermaltotal: -2555.01498608 hartree
thermalcorr: 0.00607785 hartree
nonthermalcorr: 0.07968016 hartree
totalcorr: 0.08575801 hartree
thermalcorrenthalpy: 0.00094421 hartree
totalenthalpy: -2555.01404187 hartree
vibrat: 0.00546764 hartree
rotat: 0.01210320 hartree
transl: 0.01918760 hartree
total: 0.03675844 hartree
totalentropycorr: -0.03675844 hartree
gibbsenthalpy: -2555.05080031 hartree
gibbsminuselec: 0.04994378 hartree
