program: Orca
programVersion: 5.0.4
elementType: C P Se P C C C C C C C C C C C C C C C C C H H H H H H H H H H H H H H H H
charge: 2
multiplicity: 1
keywords: Freq RIJCOSX PBEh-3c
frequency: 0.00 0.00 0.00 0.00 0.00 0.00 17.04 24.33 32.36 50.19 56.62 64.95 67.24 83.58 103.44 112.60 148.98 183.71 224.43 258.48 267.26 276.25 294.12 300.92 399.49 406.78 410.78 424.07 440.31 448.30 471.99 504.46 591.65 625.75 629.04 633.65 681.93 692.87 705.07 743.07 752.45 780.20 789.01 790.42 793.28 796.81 878.42 887.18 887.57 936.96 995.77 1003.65 1009.52 1029.81 1032.45 1039.30 1046.03 1049.26 1052.04 1071.66 1073.05 1075.66 1077.66 1078.66 1079.11 1148.25 1152.40 1153.79 1158.67 1163.08 1164.16 1232.17 1237.62 1238.30 1252.65 1258.45 1262.52 1368.02 1379.09 1380.40 1422.69 1429.64 1433.84 1518.35 1523.62 1524.12 1546.30 1548.66 1556.83 1651.14 1656.50 1668.30 1678.29 1686.05 1693.26 2493.72 3263.26 3273.63 3273.80 3281.16 3281.60 3285.44 3289.98 3291.96 3293.21 3301.17 3303.33 3304.70 3306.54 3307.92 3309.16
frequency: 17.04 24.33 32.36 50.19 56.62 64.95 67.24 83.58 103.44 112.60 148.98 183.71 224.43 258.48 267.26 276.25 294.12 300.92 399.49 406.78 410.78 424.07 440.31 448.30 471.99 504.46 591.65 625.75 629.04 633.65 681.93 692.87 705.07 743.07 752.45 780.20 789.01 790.42 793.28 796.81 878.42 887.18 887.57 936.96 995.77 1003.65 1009.52 1029.81 1032.45 1039.30 1046.03 1049.26 1052.04 1071.66 1073.05 1075.66 1077.66 1078.66 1079.11 1148.25 1152.40 1153.79 1158.67 1163.08 1164.16 1232.17 1237.62 1238.30 1252.65 1258.45 1262.52 1368.02 1379.09 1380.40 1422.69 1429.64 1433.84 1518.35 1523.62 1524.12 1546.30 1548.66 1556.83 1651.14 1656.50 1668.30 1678.29 1686.05 1693.26 2493.72 3263.26 3273.63 3273.80 3281.16 3281.60 3285.44 3289.98 3291.96 3293.21 3301.17 3303.33 3304.70 3306.54 3307.92 3309.16
formula: C18H16P2Se
InChI: InChI=1/C12H10PSe.C6H6P/c14-13(11-7-3-1-4-8-11)12-9-5-2-6-10-12;7-6-4-2-1-3-5-6/h1-10H;1-5,7H
37 atoms
C  3.357971 1.289363 -0.262152
P  1.653644 1.699291 -0.021949
Se 0.998858 -0.351112 1.240886
P  -0.996826 -0.505602 0.630116
C  -1.754627 -2.056255 0.560124
C  -3.156109 -2.134913 0.736775
C  -3.757689 -3.372499 0.749114
C  -2.98686 -4.523464 0.589363
C  -1.603275 -4.449433 0.420673
C  -0.976894 -3.225232 0.412008
C  -1.921271 0.894146 0.199597
C  -2.876735 0.79447 -0.835638
C  -3.572751 1.922329 -1.211149
C  -3.338825 3.13392 -0.563327
C  -2.398421 3.234042 0.461387
C  -1.675971 2.125416 0.841477
C  4.362279 1.616164 0.665734
C  5.683481 1.365867 0.360938
C  6.014785 0.783277 -0.860567
C  5.029702 0.452671 -1.785696
C  3.704816 0.705523 -1.494449
H  1.776664 2.418697 1.1905
H  -3.751101 -1.24524 0.895758
H  -4.825613 -3.450752 0.897713
H  -3.469452 -5.491966 0.601065
H  -1.023501 -5.352763 0.293368
H  0.094404 -3.169444 0.268448
H  -3.044339 -0.140458 -1.354702
H  -4.295056 1.865917 -2.013617
H  -3.897387 4.011891 -0.860284
H  -2.243944 4.178235 0.964499
H  -0.974785 2.195949 1.663658
H  4.107488 2.077797 1.611384
H  6.460635 1.626939 1.065574
H  7.05346 0.592556 -1.095534
H  5.302571 0.013026 -2.734766
H  2.940676 0.471848 -2.226328
totalener: -3775.76405350 hartree
nucrepener: 2265.84313722 hartree
electener: -6041.60719071 hartree
oneelecener: -9686.23304233 hartree
twoeener: 3644.62585162 hartree
kineticenergy: 3767.46888656 hartree
exchangeener: -128.630785375770 hartree
correlationener: -8.963935624824 hartree
xcener: -137.594721000594 hartree
chargesum: 2.0000000
charge: -0.218867 0.242917 0.103011 0.649958 -0.164557 -0.229500 -0.189221 -0.177784 -0.187423 -0.205846 -0.172438 -0.228265 -0.193679 -0.179004 -0.195326 -0.212702 -0.205769 -0.189716 -0.198877 -0.191886 -0.226160 0.147375 0.297700 0.308674 0.318180 0.308844 0.284638 0.298473 0.308464 0.315937 0.305151 0.284284 0.261520 0.289057 0.296533 0.285152 0.261148
charge: -0.257159 0.362789 0.098014 0.813368 -0.226912 -0.079021 -0.096973 -0.010695 -0.093203 -0.074743 -0.230983 -0.082475 -0.096129 -0.018699 -0.096144 -0.087687 -0.099387 -0.104195 -0.044270 -0.109263 -0.095552 0.063304 0.169867 0.179498 0.182603 0.179459 0.167379 0.169576 0.179199 0.181724 0.177634 0.161675 0.154425 0.169275 0.171591 0.167552 0.154560
qa: -0.2189 0.2429 0.1030 0.6500 -0.1646 -0.2295 -0.1892 -0.1778 -0.1874 -0.2058 -0.1724 -0.2283 -0.1937 -0.1790 -0.1953 -0.2127 -0.2058 -0.1897 -0.1989 -0.1919 -0.2262 0.1474 0.2977 0.3087 0.3182 0.3088 0.2846 0.2985 0.3085 0.3159 0.3052 0.2843 0.2615 0.2891 0.2965 0.2852 0.2611
va: 3.7006 2.8759 2.5038 4.0726 3.6638 3.7544 3.7744 3.7173 3.7699 3.7562 3.6696 3.7546 3.7767 3.7250 3.7857 3.7607 3.7803 3.7793 3.7532 3.7883 3.7770 0.9490 0.8784 0.8749 0.8692 0.8745 0.8885 0.8786 0.8750 0.8704 0.8770 0.8870 0.8987 0.8840 0.8803 0.8857 0.9005
dispersion: -0.029883889 hartree
energy: -3775.746241898786 hartree
dipole: -11.27067 9.28265 -1.98802 3.16943 -3.55746 -0.38803 -14.90708 14.47267 -0.43441
magnitude: 2.07160 au
magnitude: 5.26558 debye
temp: 298.15 k
press: 1.00 atm
zeropoint: 0.29463405 hartree
thermalvibcorrection: 0.01683404 hartree
thermalrotcorrection: 0.00141627 hartree
thermaltrasncorrection: 0.00141627 hartree
thermaltotal: -3775.43194127 hartree
thermalcorr: 0.01966658 hartree
nonthermalcorr: 0.29463405 hartree
totalcorr: 0.31430063 hartree
thermalcorrenthalpy: 0.00094421 hartree
totalenthalpy: -3775.43099706 hartree
vibrat: 0.03053906 hartree
rotat: 0.01684186 hartree
transl: 0.02073652 hartree
total: 0.06811744 hartree
totalentropycorr: -0.06811744 hartree
gibbsenthalpy: -3775.49911450 hartree
gibbsminuselec: 0.24712740 hartree
