program: Orca
programVersion: 5.0.4
elementType: F Se F P C C C C C C C C C C C C P C C C C C C C C C C C C H H H H H H H H H H H H H H H H H H H H
charge: 0
multiplicity: 1
keywords: Freq RIJCOSX PBEh-3c
frequency: 0.00 0.00 0.00 0.00 0.00 0.00 14.99 19.29 32.61 35.82 40.53 43.69 50.98 73.93 83.65 88.63 97.09 103.54 111.97 162.57 169.07 193.89 209.74 213.28 222.79 233.88 235.24 263.68 274.46 276.26 283.79 390.81 412.54 416.13 418.25 425.59 428.17 430.12 433.48 459.59 463.47 508.48 515.62 525.77 528.44 540.77 576.94 643.53 644.17 645.23 645.41 718.07 721.21 730.62 731.18 737.07 738.17 740.55 742.28 785.27 785.91 792.76 793.28 895.69 897.99 904.31 905.84 977.31 977.70 987.74 988.74 1029.18 1032.51 1038.69 1041.08 1042.51 1042.97 1043.53 1044.55 1053.98 1055.99 1061.14 1065.35 1083.21 1083.54 1086.59 1087.34 1138.74 1139.50 1147.72 1148.24 1152.19 1154.54 1161.48 1162.77 1217.12 1217.31 1217.81 1218.28 1247.53 1248.12 1257.69 1260.60 1357.98 1361.40 1370.92 1372.10 1402.32 1402.40 1409.64 1412.10 1516.95 1517.21 1523.14 1523.65 1569.90 1571.27 1573.74 1573.93 1690.23 1691.51 1695.15 1695.86 1711.74 1711.86 1712.50 1712.75 3254.72 3259.75 3261.40 3264.69 3265.15 3267.25 3267.58 3272.08 3273.57 3276.90 3278.05 3282.30 3282.35 3286.54 3287.06 3290.26 3291.57 3292.26 3293.42 3298.41
frequency: 14.99 19.29 32.61 35.82 40.53 43.69 50.98 73.93 83.65 88.63 97.09 103.54 111.97 162.57 169.07 193.89 209.74 213.28 222.79 233.88 235.24 263.68 274.46 276.26 283.79 390.81 412.54 416.13 418.25 425.59 428.17 430.12 433.48 459.59 463.47 508.48 515.62 525.77 528.44 540.77 576.94 643.53 644.17 645.23 645.41 718.07 721.21 730.62 731.18 737.07 738.17 740.55 742.28 785.27 785.91 792.76 793.28 895.69 897.99 904.31 905.84 977.31 977.70 987.74 988.74 1029.18 1032.51 1038.69 1041.08 1042.51 1042.97 1043.53 1044.55 1053.98 1055.99 1061.14 1065.35 1083.21 1083.54 1086.59 1087.34 1138.74 1139.50 1147.72 1148.24 1152.19 1154.54 1161.48 1162.77 1217.12 1217.31 1217.81 1218.28 1247.53 1248.12 1257.69 1260.60 1357.98 1361.40 1370.92 1372.10 1402.32 1402.40 1409.64 1412.10 1516.95 1517.21 1523.14 1523.65 1569.90 1571.27 1573.74 1573.93 1690.23 1691.51 1695.15 1695.86 1711.74 1711.86 1712.50 1712.75 3254.72 3259.75 3261.40 3264.69 3265.15 3267.25 3267.58 3272.08 3273.57 3276.90 3278.05 3282.30 3282.35 3286.54 3287.06 3290.26 3291.57 3292.26 3293.42 3298.41
formula: C24H20F2P2Se
InChI: InChI=1/C24H20F2P2Se/c25-29(26,27(21-13-5-1-6-14-21)22-15-7-2-8-16-22)28(23-17-9-3-10-18-23)24-19-11-4-12-20-24/h1-20H
49 atoms
F  0.467718 -1.084442 1.566786
Se -0.054127 0.562437 0.928061
F  -0.603866 2.13781 0.099658
P  -1.455083 -0.798075 -0.345834
C  -2.539804 -1.313874 1.027402
C  -3.204341 -0.419357 1.867873
C  -4.017416 -0.889072 2.884729
C  -4.177842 -2.256465 3.072155
C  -3.518048 -3.151288 2.245951
C  -2.6954 -2.6807 1.231634
C  -2.497758 0.356763 -1.294341
C  -1.8875 1.087824 -2.316487
C  -2.644285 1.871151 -3.169034
C  -4.024863 1.921204 -3.03212
C  -4.64223 1.182338 -2.036399
C  -3.88508 0.406036 -1.170656
P  1.584737 0.6410 -0.740638
C  2.781665 1.810855 0.003974
C  4.15109 1.548796 -0.040878
C  5.065563 2.501765 0.383475
C  4.628838 3.727808 0.857997
C  3.26939 4.002092 0.890681
C  2.351188 3.060817 0.45613
C  2.377721 -0.980408 -0.566575
C  2.219402 -1.843664 -1.648178
C  2.779813 -3.113107 -1.626835
C  3.499356 -3.526877 -0.518459
C  3.654714 -2.676259 0.570024
C  3.091297 -1.413852 0.552053
H  -3.095604 0.648899 1.720009
H  -4.526875 -0.188599 3.533235
H  -4.815293 -2.621605 3.866625
H  -3.635369 -4.21645 2.394146
H  -2.167731 -3.380792 0.596194
H  -0.814224 1.04366 -2.452304
H  -2.15482 2.441528 -3.947241
H  -4.616484 2.527478 -3.705511
H  -5.718755 1.205735 -1.929144
H  -4.389574 -0.169034 -0.406642
H  4.516514 0.601146 -0.413189
H  6.12372 2.279484 0.341477
H  5.342767 4.468822 1.192232
H  2.917127 4.960386 1.249086
H  1.29853 3.306368 0.466436
H  1.653228 -1.520952 -2.51343
H  2.65263 -3.774363 -2.473524
H  3.939642 -4.51529 -0.497287
H  4.206585 -3.006282 1.440076
H  3.209136 -0.761695 1.40661
totalener: -4206.24126606 hartree
nucrepener: 3815.94056463 hartree
electener: -8022.18183069 hartree
twoeener: 5398.86290175 hartree
kineticenergy: 4194.86884655 hartree
exchangeener: -158.414163210820 hartree
correlationener: -11.671842495255 hartree
xcener: -170.086005706075 hartree
chargesum: 0.0000000
charge: -0.505500 0.734765 -0.511028 0.404413 -0.200319 -0.232247 -0.205062 -0.225285 -0.204938 -0.242735 -0.159585 -0.241325 -0.200606 -0.232017 -0.197428 -0.261973 0.404889 -0.194854 -0.266662 -0.198346 -0.232181 -0.194028 -0.275640 -0.184880 -0.247441 -0.205895 -0.224235 -0.211540 -0.194842 0.261482 0.227793 0.227481 0.226284 0.239512 0.254548 0.222830 0.222433 0.220614 0.247476 0.249243 0.223403 0.223772 0.226175 0.272358 0.233752 0.223849 0.225451 0.224905 0.253165
charge: -0.434987 0.577841 -0.454110 0.421919 -0.204225 -0.128553 -0.133224 -0.118766 -0.132701 -0.116103 -0.201809 -0.114063 -0.132928 -0.123545 -0.137173 -0.131870 0.413163 -0.201831 -0.136910 -0.133106 -0.128042 -0.129643 -0.135519 -0.212461 -0.118580 -0.139683 -0.114666 -0.136578 -0.101598 0.148057 0.140200 0.139331 0.139977 0.145647 0.144033 0.138460 0.137077 0.136969 0.146215 0.146619 0.138159 0.137720 0.139254 0.154811 0.142454 0.138812 0.138352 0.139228 0.148374
qa: -0.5055 0.7348 -0.5110 0.4044 -0.2003 -0.2322 -0.2051 -0.2253 -0.2049 -0.2427 -0.1596 -0.2413 -0.2006 -0.2320 -0.1974 -0.2620 0.4049 -0.1949 -0.2667 -0.1983 -0.2322 -0.1940 -0.2756 -0.1849 -0.2474 -0.2059 -0.2242 -0.2115 -0.1948 0.2615 0.2278 0.2275 0.2263 0.2395 0.2545 0.2228 0.2224 0.2206 0.2475 0.2492 0.2234 0.2238 0.2262 0.2724 0.2338 0.2238 0.2255 0.2249 0.2532
va: 0.8378 3.1897 0.8383 3.0176 3.7953 3.7776 3.8236 3.8164 3.8118 3.8208 3.7090 3.8291 3.8240 3.8202 3.8224 3.8223 3.0319 3.7687 3.8149 3.8264 3.8193 3.8028 3.7687 3.7428 3.8250 3.8143 3.8174 3.8233 3.8178 0.8969 0.9088 0.9088 0.9089 0.9110 0.9046 0.9100 0.9104 0.9106 0.9022 0.9049 0.9097 0.9101 0.9092 0.9225 0.9143 0.9098 0.9094 0.9096 0.9019
dispersion: -0.043544207 hartree
energy: -4206.211348384628 hartree
dipole: 0.50973 -0.53719 -0.02745 -7.74211 7.23094 -0.51117 -10.78665 10.81880 0.03215
magnitude: 0.51292 au
magnitude: 1.30374 debye
temp: 298.15 k
press: 1.00 atm
zeropoint: 0.38443371 hartree
thermalvibcorrection: 0.02378263 hartree
thermalrotcorrection: 0.00141627 hartree
thermaltrasncorrection: 0.00141627 hartree
thermaltotal: -4205.80029950 hartree
thermalcorr: 0.02661518 hartree
nonthermalcorr: 0.38443371 hartree
totalcorr: 0.41104888 hartree
thermalcorrenthalpy: 0.00094421 hartree
totalenthalpy: -4205.79935530 hartree
vibrat: 0.04299192 hartree
rotat: 0.01734241 hartree
transl: 0.02111429 hartree
total: 0.08144861 hartree
totalentropycorr: -0.08144861 hartree
gibbsenthalpy: -4205.88080391 hartree
gibbsminuselec: 0.33054448 hartree
