program: Orca
programVersion: 5.0.4
elementType: F Se F P C C C C C C C C C C C C P C C C C C C C C C C C C H H H H H H H H H H H H H H H H H H H H
charge: 0
multiplicity: 1
keywords: Opt RIJCOSX PBEh-3c
formula: C24H20F2P2Se
InChI: InChI=1/C24H20F2P2Se/c25-29(26,27(21-13-5-1-6-14-21)22-15-7-2-8-16-22)28(23-17-9-3-10-18-23)24-19-11-4-12-20-24/h1-20H
49 atoms
F  0.467718 -1.084442 1.566786
Se -0.054127 0.562437 0.928061
F  -0.603866 2.13781 0.099658
P  -1.455083 -0.798075 -0.345834
C  -2.539804 -1.313874 1.027402
C  -3.204341 -0.419357 1.867873
C  -4.017416 -0.889072 2.884729
C  -4.177842 -2.256465 3.072155
C  -3.518048 -3.151288 2.245951
C  -2.6954 -2.6807 1.231634
C  -2.497758 0.356763 -1.294341
C  -1.8875 1.087824 -2.316487
C  -2.644285 1.871151 -3.169034
C  -4.024863 1.921204 -3.03212
C  -4.64223 1.182338 -2.036399
C  -3.88508 0.406036 -1.170656
P  1.584737 0.6410 -0.740638
C  2.781665 1.810855 0.003974
C  4.15109 1.548796 -0.040878
C  5.065563 2.501765 0.383475
C  4.628838 3.727808 0.857997
C  3.26939 4.002092 0.890681
C  2.351188 3.060817 0.45613
C  2.377721 -0.980408 -0.566575
C  2.219402 -1.843664 -1.648178
C  2.779813 -3.113107 -1.626835
C  3.499356 -3.526877 -0.518459
C  3.654714 -2.676259 0.570024
C  3.091297 -1.413852 0.552053
H  -3.095604 0.648899 1.720009
H  -4.526875 -0.188599 3.533235
H  -4.815293 -2.621605 3.866625
H  -3.635369 -4.21645 2.394146
H  -2.167731 -3.380792 0.596194
H  -0.814224 1.04366 -2.452304
H  -2.15482 2.441528 -3.947241
H  -4.616484 2.527478 -3.705511
H  -5.718755 1.205735 -1.929144
H  -4.389574 -0.169034 -0.406642
H  4.516514 0.601146 -0.413189
H  6.12372 2.279484 0.341477
H  5.342767 4.468822 1.192232
H  2.917127 4.960386 1.249086
H  1.29853 3.306368 0.466436
H  1.653228 -1.520952 -2.51343
H  2.65263 -3.774363 -2.473524
H  3.939642 -4.51529 -0.497287
H  4.206585 -3.006282 1.440076
H  3.209136 -0.761695 1.40661
totalener: -4206.24110856 hartree
nucrepener: 3815.76796382 hartree
electener: -8022.00907238 hartree
twoeener: 5398.69514145 hartree
kineticenergy: 4194.86506591 hartree
exchangeener: -158.413565219577 hartree
correlationener: -11.672002801215 hartree
xcener: -170.085568020792 hartree
dispersion: -0.043552002 hartree
dispersion: -0.043499455 hartree
dispersion: -0.043403921 hartree
dispersion: -0.043621629 hartree
dispersion: -0.043514052 hartree
dispersion: -0.043421510 hartree
dispersion: -0.043487103 hartree
dispersion: -0.043660250 hartree
dispersion: -0.043505889 hartree
dispersion: -0.043544225 hartree
dispersion: -0.043529670 hartree
dispersion: -0.043543465 hartree
dispersion: -0.043542146 hartree
dispersion: -0.043549269 hartree
dispersion: -0.043546267 hartree
chargesum: -0.0000000
charge: -0.505511 0.734825 -0.511039 0.404396 -0.200328 -0.232276 -0.205050 -0.225277 -0.204945 -0.242715 -0.159567 -0.241368 -0.200595 -0.232015 -0.197408 -0.261982 0.404872 -0.194838 -0.266670 -0.198339 -0.232188 -0.194021 -0.275666 -0.184858 -0.247436 -0.205877 -0.224235 -0.211542 -0.194871 0.261490 0.227792 0.227481 0.226284 0.239507 0.254558 0.222827 0.222434 0.220608 0.247476 0.249243 0.223401 0.223775 0.226174 0.272369 0.233748 0.223840 0.225448 0.224902 0.253169
charge: -0.434996 0.577885 -0.454119 0.421905 -0.204227 -0.128570 -0.133215 -0.118761 -0.132700 -0.116094 -0.201801 -0.114087 -0.132930 -0.123538 -0.137165 -0.131868 0.413156 -0.201826 -0.136908 -0.133108 -0.128040 -0.129644 -0.135534 -0.212449 -0.118574 -0.139672 -0.114665 -0.136584 -0.101620 0.148061 0.140199 0.139329 0.139975 0.145645 0.144038 0.138459 0.137076 0.136967 0.146214 0.146619 0.138158 0.137721 0.139254 0.154817 0.142453 0.138809 0.138351 0.139228 0.148376
qa: -0.5055 0.7348 -0.5110 0.4044 -0.2003 -0.2323 -0.2051 -0.2253 -0.2049 -0.2427 -0.1596 -0.2414 -0.2006 -0.2320 -0.1974 -0.2620 0.4049 -0.1948 -0.2667 -0.1983 -0.2322 -0.1940 -0.2757 -0.1849 -0.2474 -0.2059 -0.2242 -0.2115 -0.1949 0.2615 0.2278 0.2275 0.2263 0.2395 0.2546 0.2228 0.2224 0.2206 0.2475 0.2492 0.2234 0.2238 0.2262 0.2724 0.2337 0.2238 0.2254 0.2249 0.2532
va: 0.8378 3.1897 0.8382 3.0176 3.7953 3.7776 3.8236 3.8164 3.8118 3.8208 3.7090 3.8291 3.8240 3.8202 3.8224 3.8223 3.0319 3.7687 3.8149 3.8264 3.8193 3.8029 3.7687 3.7429 3.8250 3.8143 3.8174 3.8233 3.8178 0.8969 0.9088 0.9088 0.9089 0.9110 0.9045 0.9100 0.9104 0.9106 0.9022 0.9049 0.9097 0.9101 0.9092 0.9225 0.9143 0.9098 0.9094 0.9096 0.9019
dispersion: -0.043544207 hartree
energy: -4206.211348311943 hartree
dipole: 0.50973 -0.53727 -0.02754 -7.74211 7.23094 -0.51117 -10.78665 10.81887 0.03222
magnitude: 0.51293 au
magnitude: 1.30376 debye
