program: Orca
programVersion: 5.0.4
elementType: F Se F P C C C C C C C C C C C C P C C C C C C C C C C C C H H H H H H H H H H H H H H H H H H H H
charge: 0
multiplicity: 1
keywords: SP DSD-BLYP D3BJ def2-QZVPP def2-QZVPP/C def2/J TightSCF
formula: C24H20F2P2Se
InChI: InChI=1/C24H20F2P2Se/c25-29(26,27(21-13-5-1-6-14-21)22-15-7-2-8-16-22)28(23-17-9-3-10-18-23)24-19-11-4-12-20-24/h1-20H
49 atoms
F  0.470371 -1.185858 1.454685
Se -0.051474 0.461021 0.81596
F  -0.601213 2.036393 -0.012443
P  -1.45243 -0.899491 -0.457934
C  -2.53715 -1.415291 0.915301
C  -3.201688 -0.520774 1.755772
C  -4.014762 -0.990489 2.772628
C  -4.175189 -2.357881 2.960055
C  -3.515395 -3.252704 2.13385
C  -2.692747 -2.782116 1.119534
C  -2.495105 0.255347 -1.406441
C  -1.884846 0.986408 -2.428587
C  -2.641632 1.769734 -3.281134
C  -4.02221 1.819788 -3.144221
C  -4.639577 1.080922 -2.148499
C  -3.882427 0.30462 -1.282756
P  1.587391 0.539584 -0.852739
C  2.784318 1.709439 -0.108127
C  4.153744 1.447379 -0.152978
C  5.068216 2.400348 0.271374
C  4.631492 3.626392 0.745896
C  3.272043 3.900676 0.77858
C  2.353841 2.959401 0.34403
C  2.380374 -1.081824 -0.678676
C  2.222055 -1.94508 -1.760279
C  2.782466 -3.214523 -1.738936
C  3.502009 -3.628293 -0.63056
C  3.657367 -2.777675 0.457923
C  3.09395 -1.515269 0.439952
H  -3.092951 0.547483 1.607909
H  -4.524222 -0.290015 3.421134
H  -4.81264 -2.723022 3.754524
H  -3.632716 -4.317866 2.282045
H  -2.165078 -3.482208 0.484093
H  -0.811571 0.942244 -2.564404
H  -2.152167 2.340112 -4.059341
H  -4.61383 2.426061 -3.817611
H  -5.716102 1.104319 -2.041244
H  -4.386921 -0.27045 -0.518743
H  4.519167 0.49973 -0.52529
H  6.126374 2.178068 0.229376
H  5.34542 4.367406 1.080132
H  2.91978 4.858969 1.136986
H  1.301183 3.204952 0.354336
H  1.655881 -1.622368 -2.62553
H  2.655283 -3.87578 -2.585624
H  3.942295 -4.616706 -0.609387
H  4.209238 -3.107698 1.327976
H  3.211789 -0.863111 1.294509
totalener: -4206.17267356 hartree
nucrepener: 3815.94056392 hartree
electener: -8022.11323748 hartree
twoeener: 5399.39359692 hartree
kineticenergy: 4201.38173440 hartree
exchangeener: -87.794678761371 hartree
correlationener: -4.914997690458 hartree
xcener: -92.709676451830 hartree
chargesum: -0.0000000
charge: -0.542163 0.652251 -0.561605 0.116002 0.134031 -0.104407 -0.131356 -0.095362 -0.129839 -0.085054 0.079284 -0.029495 -0.138673 -0.088193 -0.155508 -0.085543 0.143093 0.019893 -0.076306 -0.139734 -0.089919 -0.132753 -0.104340 0.133340 -0.073174 -0.147072 -0.092860 -0.127267 -0.045485 0.093173 0.098764 0.094350 0.096853 0.098230 0.078605 0.094421 0.092826 0.094817 0.099389 0.092124 0.096474 0.092030 0.101335 0.109725 0.094311 0.098699 0.094214 0.094506 0.083364
charge: -0.243195 0.575801 -0.272913 0.473819 -0.267810 0.042296 0.068523 0.075481 0.071342 0.049662 -0.256246 0.043532 0.068802 0.071656 0.064471 0.053307 0.467499 -0.256417 0.048201 0.065070 0.069426 0.067367 0.045703 -0.272591 0.039302 0.066779 0.077076 0.070845 0.057907 -0.051561 -0.058598 -0.057379 -0.059027 -0.054372 -0.066468 -0.059114 -0.058918 -0.060406 -0.057602 -0.055847 -0.059261 -0.059142 -0.057860 -0.066804 -0.056675 -0.060417 -0.057198 -0.059232 -0.048814
qa: -0.5422 0.6523 -0.5616 0.1160 0.1340 -0.1044 -0.1314 -0.0954 -0.1298 -0.0851 0.0793 -0.0295 -0.1387 -0.0882 -0.1555 -0.0855 0.1431 0.0199 -0.0763 -0.1397 -0.0899 -0.1328 -0.1043 0.1333 -0.0732 -0.1471 -0.0929 -0.1273 -0.0455 0.0932 0.0988 0.0944 0.0969 0.0982 0.0786 0.0944 0.0928 0.0948 0.0994 0.0921 0.0965 0.0920 0.1013 0.1097 0.0943 0.0987 0.0942 0.0945 0.0834
va: 0.6638 3.0528 0.6341 3.0448 3.5400 3.7364 3.8287 3.8231 3.7941 3.7239 3.5022 3.6422 3.8032 3.8288 3.8131 3.6937 2.9744 3.5383 3.6839 3.8178 3.8270 3.8020 3.6786 3.5152 3.6928 3.8044 3.8306 3.8193 3.7260 0.9962 0.9853 0.9853 0.9848 0.9932 1.0027 0.9831 0.9832 0.9834 0.9897 0.9991 0.9843 0.9846 0.9826 1.0254 1.0026 0.9848 0.9844 0.9863 0.9921
total: -4208.872669279 hartree
dispersion: -0.060716787 hartree
energy: -4208.933386065612 hartree
dipole: 0.50973 -0.49172 0.01801 -7.74211 7.25425 -0.48787 -10.78665 10.73785 -0.04880
magnitude: 0.49063 au
magnitude: 1.24709 debye
