program: Orca
programVersion: 5.0.4
elementType: O Se P C C C C C C C C C C C C P C C C C C C C C C C C C H H H H H H H H H H H H H H H H H H H H
charge: 0
multiplicity: 1
keywords: Freq RIJCOSX PBEh-3c
frequency: 0.00 0.00 0.00 0.00 0.00 0.00 18.25 26.24 32.92 35.27 43.11 55.51 72.65 80.93 84.19 92.33 104.50 108.39 112.29 187.45 188.78 201.35 208.73 217.35 230.71 242.38 249.04 270.85 274.54 384.00 405.73 416.47 418.92 423.76 426.22 429.00 434.19 455.84 459.69 503.04 513.53 521.62 528.50 643.42 643.72 644.31 644.58 718.46 719.95 730.49 732.16 735.13 736.18 736.98 739.95 783.18 785.74 789.68 792.46 888.66 896.26 898.47 900.53 921.36 963.93 975.69 977.83 980.04 1023.53 1031.13 1032.13 1034.11 1041.46 1042.18 1043.76 1044.18 1051.20 1054.55 1055.47 1056.11 1083.60 1084.31 1085.74 1085.97 1138.78 1139.45 1145.14 1145.59 1151.36 1153.67 1158.03 1159.65 1216.43 1217.06 1217.13 1217.26 1247.39 1249.03 1255.16 1256.94 1359.03 1359.97 1369.71 1370.06 1402.60 1402.86 1409.05 1411.55 1516.75 1517.23 1522.10 1522.99 1569.51 1570.23 1572.53 1574.10 1689.92 1690.42 1693.62 1694.17 1710.24 1710.65 1711.54 1712.00 3259.74 3259.82 3261.89 3262.35 3263.05 3264.49 3266.96 3270.57 3271.13 3272.80 3274.52 3280.33 3280.79 3281.56 3282.04 3287.16 3289.36 3290.30 3291.37 3293.93
frequency: 18.25 26.24 32.92 35.27 43.11 55.51 72.65 80.93 84.19 92.33 104.50 108.39 112.29 187.45 188.78 201.35 208.73 217.35 230.71 242.38 249.04 270.85 274.54 384.00 405.73 416.47 418.92 423.76 426.22 429.00 434.19 455.84 459.69 503.04 513.53 521.62 528.50 643.42 643.72 644.31 644.58 718.46 719.95 730.49 732.16 735.13 736.18 736.98 739.95 783.18 785.74 789.68 792.46 888.66 896.26 898.47 900.53 921.36 963.93 975.69 977.83 980.04 1023.53 1031.13 1032.13 1034.11 1041.46 1042.18 1043.76 1044.18 1051.20 1054.55 1055.47 1056.11 1083.60 1084.31 1085.74 1085.97 1138.78 1139.45 1145.14 1145.59 1151.36 1153.67 1158.03 1159.65 1216.43 1217.06 1217.13 1217.26 1247.39 1249.03 1255.16 1256.94 1359.03 1359.97 1369.71 1370.06 1402.60 1402.86 1409.05 1411.55 1516.75 1517.23 1522.10 1522.99 1569.51 1570.23 1572.53 1574.10 1689.92 1690.42 1693.62 1694.17 1710.24 1710.65 1711.54 1712.00 3259.74 3259.82 3261.89 3262.35 3263.05 3264.49 3266.96 3270.57 3271.13 3272.80 3274.52 3280.33 3280.79 3281.56 3282.04 3287.16 3289.36 3290.30 3291.37 3293.93
formula: C24H20OP2Se
InChI: InChI=1/C24H20OP2Se/c25-28(26(21-13-5-1-6-14-21)22-15-7-2-8-16-22)27(23-17-9-3-10-18-23)24-19-11-4-12-20-24/h1-20H
48 atoms
O  0.03397 -2.892125 -1.215509
Se -0.089602 -1.502293 -0.359269
P  1.518593 -0.001475 -1.270816
C  1.71881 1.055444 0.208695
C  1.706891 2.431748 -0.000941
C  1.859444 3.310691 1.061843
C  2.010192 2.821965 2.348838
C  2.012994 1.450653 2.57253
C  1.871886 0.573371 1.510914
C  2.939141 -1.14293 -1.170844
C  4.072532 -0.893083 -0.39697
C  5.158537 -1.753064 -0.447202
C  5.124432 -2.876035 -1.260315
C  4.004424 -3.126194 -2.038737
C  2.922931 -2.260721 -2.0084
P  -1.843572 -0.399379 -1.455939
C  -1.74873 1.184049 -0.550782
C  -1.699976 1.291034 0.841234
C  -1.590408 2.531259 1.445253
C  -1.539712 3.681984 0.669177
C  -1.584214 3.588919 -0.712206
C  -1.678243 2.344288 -1.319198
C  -3.202792 -1.293164 -0.616632
C  -3.277085 -2.677771 -0.792205
C  -4.328461 -3.395288 -0.245748
C  -5.332292 -2.744284 0.456765
C  -5.278472 -1.367618 0.61152
C  -4.220043 -0.644777 0.081262
H  1.575814 2.818373 -1.003741
H  1.852992 4.377528 0.881791
H  2.127159 3.505909 3.179397
H  2.132154 1.064412 3.576389
H  1.89639 -0.493207 1.697596
H  4.119159 -0.021379 0.242022
H  6.033285 -1.54309 0.15444
H  5.971137 -3.549091 -1.292466
H  3.971086 -3.998393 -2.677924
H  2.061392 -2.466533 -2.628589
H  -1.755244 0.402161 1.457879
H  -1.53955 2.601902 2.523381
H  -1.459032 4.650732 1.144658
H  -1.542975 4.482865 -1.32055
H  -1.70301 2.270968 -2.399561
H  -2.506612 -3.201148 -1.345158
H  -4.363864 -4.468939 -0.375089
H  -6.155621 -3.307167 0.876427
H  -6.061993 -0.850145 1.149605
H  -4.194043 0.428941 0.213373
totalener: -4081.96521159 hartree
nucrepener: 3557.78309798 hartree
electener: -7639.74830957 hartree
twoeener: 5088.99655952 hartree
kineticenergy: 4071.28610628 hartree
exchangeener: -151.718642376699 hartree
correlationener: -11.185625395701 hartree
xcener: -162.904267772400 hartree
chargesum: -0.0000000
charge: -0.689467 0.590330 0.340772 -0.207377 -0.240104 -0.198054 -0.233332 -0.206822 -0.233003 -0.189418 -0.252253 -0.199753 -0.232552 -0.201786 -0.235197 0.390451 -0.234943 -0.222888 -0.186502 -0.226064 -0.209141 -0.253326 -0.206530 -0.269453 -0.199693 -0.232931 -0.199847 -0.251548 0.237680 0.223495 0.225201 0.226347 0.249400 0.243848 0.218701 0.220993 0.224690 0.258283 0.251099 0.226412 0.226306 0.226173 0.242296 0.275239 0.226632 0.222440 0.221006 0.244191
charge: -0.586806 0.460922 0.353640 -0.206765 -0.117197 -0.130387 -0.125071 -0.136590 -0.132293 -0.206453 -0.137405 -0.137627 -0.128416 -0.130252 -0.120630 0.370141 -0.217312 -0.124980 -0.125059 -0.116895 -0.138076 -0.126766 -0.207099 -0.135260 -0.128852 -0.130417 -0.133935 -0.138623 0.144150 0.137932 0.137716 0.139099 0.143794 0.144440 0.136043 0.136466 0.139283 0.153522 0.144911 0.140389 0.137874 0.139011 0.145280 0.156341 0.139682 0.137081 0.136925 0.144521
qa: -0.6895 0.5903 0.3408 -0.2074 -0.2401 -0.1981 -0.2333 -0.2068 -0.2330 -0.1894 -0.2523 -0.1998 -0.2326 -0.2018 -0.2352 0.3905 -0.2349 -0.2229 -0.1865 -0.2261 -0.2091 -0.2533 -0.2065 -0.2695 -0.1997 -0.2329 -0.1998 -0.2515 0.2377 0.2235 0.2252 0.2263 0.2494 0.2438 0.2187 0.2210 0.2247 0.2583 0.2511 0.2264 0.2263 0.2262 0.2423 0.2752 0.2266 0.2224 0.2210 0.2442
va: 1.8145 3.3318 2.9262 3.7555 3.8244 3.8195 3.8210 3.8244 3.7914 3.7359 3.8149 3.8246 3.8199 3.8234 3.7973 2.9347 3.7532 3.7893 3.8270 3.8232 3.8109 3.8209 3.7515 3.7771 3.8190 3.8186 3.8259 3.8074 0.9159 0.9102 0.9095 0.9090 0.9043 0.9033 0.9113 0.9110 0.9093 0.9144 0.9042 0.9107 0.9091 0.9089 0.9108 0.9095 0.9089 0.9106 0.9106 0.9049
dispersion: -0.045813822 hartree
energy: -4081.945187579241 hartree
dipole: 1.88890 -1.91082 -0.02191 20.46095 -18.74011 1.72085 11.72144 -10.28741 1.43403
magnitude: 2.24014 au
magnitude: 5.69399 debye
temp: 298.15 k
press: 1.00 atm
zeropoint: 0.38255424 hartree
thermalvibcorrection: 0.02233946 hartree
thermalrotcorrection: 0.00141627 hartree
thermaltrasncorrection: 0.00141627 hartree
thermaltotal: -4081.53746133 hartree
thermalcorr: 0.02517201 hartree
nonthermalcorr: 0.38255424 hartree
totalcorr: 0.40772625 hartree
thermalcorrenthalpy: 0.00094421 hartree
totalenthalpy: -4081.53651712 hartree
vibrat: 0.04023375 hartree
rotat: 0.01719995 hartree
transl: 0.02104887 hartree
total: 0.07848256 hartree
totalentropycorr: -0.07848256 hartree
gibbsenthalpy: -4081.61499968 hartree
gibbsminuselec: 0.33018790 hartree
