program: Orca
programVersion: 5.0.4
elementType: Se F C C C C C C H H H H H H
charge: 1
multiplicity: 1
keywords: Opt RIJCOSX PBEh-3c
formula: C6H6FSe
InChI: InChI=1/C6H6FSe/c7-8-6-4-2-1-3-5-6/h1-5,8H
14 atoms
Se 2.663282 -0.15401 -0.012895
F  3.048903 0.850004 -1.346394
C  0.809556 -0.107175 0.03436
C  0.10744 1.037774 0.427064
C  -1.271287 0.991795 0.423612
C  -1.930675 -0.171886 0.034672
C  -1.223047 -1.300867 -0.356636
C  0.159288 -1.279575 -0.365273
H  2.909155 0.883714 0.995669
H  0.616021 1.944341 0.729795
H  -1.83711 1.861574 0.726483
H  -3.012008 -0.196612 0.039803
H  -1.746874 -2.197064 -0.657176
H  0.707457 -2.162112 -0.673085
totalener: -2731.52898233 hartree
nucrepener: 591.80034329 hartree
electener: -3323.32932562 hartree
oneelecener: -4952.74882711 hartree
twoeener: 1629.41950149 hartree
kineticenergy: 2727.44426393 hartree
exchangeener: -72.380187134823 hartree
correlationener: -4.341330351743 hartree
xcener: -76.721517486566 hartree
dispersion: -0.008150149 hartree
dispersion: -0.008151926 hartree
dispersion: -0.008154317 hartree
dispersion: -0.008153643 hartree
dispersion: -0.008149371 hartree
dispersion: -0.008152121 hartree
energy: -12404.1935 -1607.3531 -1442.5522 -1442.4924 -1442.4675 -688.7658 -290.7602 -289.8713 -289.8199 -289.3472 -289.1680 -289.1402 -230.1037 -172.6927 -172.5540 -172.4194 -70.8036 -70.7409 -70.6203 -70.5081 -70.4615 -41.4606 -31.6608 -29.6230 -28.0676 -27.1270 -23.8441 -23.4660 -21.3773 -21.0877 -20.0663 -19.8388 -19.2215 -18.7869 -18.3245 -17.8714 -16.7829 -16.6570 -15.9434 -15.6561 -13.4296 -13.0687 -7.1714 -4.9936 -4.4024 -4.2308 -2.9574 -0.0214 0.2690 0.8597 1.0308 1.2953 2.1620 2.7879 3.5756 4.2521 4.3034 4.8835 6.1071 7.0575 7.2160 7.7356 7.9171 8.6047 9.8101 10.3158 11.1962 11.5611 11.6746 11.8482 12.2730 12.4960 12.6364 13.0709 13.6867 13.9458 14.3984 15.5871 15.7598 16.9523 17.5308 19.0916 21.0091 21.7337 21.9160 22.1155 22.9657 23.2517 23.6797 24.3079 25.0748 25.2518 25.3575 26.8401 28.3122 29.0375 29.3116 29.4186 29.8206 30.2321 30.6106 31.1019 31.5981 34.2442 35.2486 35.9149 36.4146 37.0997 37.4481 38.1284 39.6835 41.1793 44.8384 45.1285 47.3712 49.9790 50.7485 52.8638 53.3297 54.6318 54.7474 55.1578 55.1797 59.1015 59.2698 59.8798 64.2142 65.7023 66.7147 69.0779 69.1859 69.5413 70.8411 71.1179 72.1894 78.0669 79.5136 82.6605 84.1561 85.9505 87.5618 89.8513 355.2608 366.1746 366.2938 378.4671 379.5905 390.6185 882.0290 electronvolt
chargesum: 1.0000000
charge: 0.934215 -0.381501 -0.243658 -0.186808 -0.201647 -0.185574 -0.200377 -0.209957 0.237576 0.274406 0.292068 0.294884 0.291849 0.284524
charge: 0.930220 -0.277189 -0.215932 -0.094219 -0.097775 -0.046863 -0.101704 -0.092313 0.152064 0.162939 0.171125 0.171922 0.171256 0.166470
qa: 0.9342 -0.3815 -0.2437 -0.1868 -0.2016 -0.1856 -0.2004 -0.2100 0.2376 0.2744 0.2921 0.2949 0.2918 0.2845
va: 2.9988 0.9745 3.6974 3.7580 3.7988 3.7461 3.7974 3.7558 0.9228 0.8932 0.8830 0.8812 0.8830 0.8867
dispersion: -0.008152372 hartree
energy: -2731.512263500465 hartree
dipole: -25.28412 24.77896 -0.50516 0.73695 -0.87523 -0.13828 1.73868 -0.88983 0.84885
magnitude: 0.99742 au
magnitude: 2.53524 debye
