program: Orca
programVersion: 5.0.4
elementType: C Se C C C C C C O H H H H H H H H
charge: 0
multiplicity: 1
keywords: Freq RIJCOSX PBEh-3c
frequency: 0.00 0.00 0.00 0.00 0.00 0.00 54.24 111.07 166.86 195.42 238.97 271.65 290.76 367.74 421.78 499.24 574.58 639.84 701.33 734.28 785.58 897.12 941.06 951.79 957.36 977.96 1032.31 1040.81 1059.02 1079.08 1130.15 1139.70 1216.54 1241.14 1371.19 1372.46 1400.98 1501.33 1511.67 1525.61 1567.23 1703.22 1706.69 3121.61 3231.79 3241.26 3245.38 3263.63 3271.37 3280.60 3290.64
frequency: 54.24 111.07 166.86 195.42 238.97 271.65 290.76 367.74 421.78 499.24 574.58 639.84 701.33 734.28 785.58 897.12 941.06 951.79 957.36 977.96 1032.31 1040.81 1059.02 1079.08 1130.15 1139.70 1216.54 1241.14 1371.19 1372.46 1400.98 1501.33 1511.67 1525.61 1567.23 1703.22 1706.69 3121.61 3231.79 3241.26 3245.38 3263.63 3271.37 3280.60 3290.64
formula: C7H8OSe
InChI: InChI=1/C7H8OSe/c1-9(8)7-5-3-2-4-6-7/h2-6H,1H3
17 atoms
C  2.726715 -0.309621 -0.363525
Se 1.911352 0.92984 0.921341
C  0.112189 0.326656 0.5474
C  -0.400214 -0.798484 1.17625
C  -1.699713 -1.198056 0.901708
C  -2.476792 -0.466799 0.014057
C  -1.956939 0.664509 -0.598775
C  -0.657977 1.072158 -0.330035
O  2.01313 2.386357 0.20118
H  3.801283 -0.128713 -0.386149
H  2.536698 -1.342475 -0.07045
H  2.304191 -0.119288 -1.349374
H  0.198611 -1.364806 1.881219
H  -2.107271 -2.07469 1.38773
H  -3.492422 -0.77625 -0.194569
H  -2.567214 1.237045 -1.284937
H  -0.245728 1.962617 -0.790173
totalener: -2746.43079487 hartree
nucrepener: 701.47551585 hartree
electener: -3447.90631072 hartree
oneelecener: -5206.28741835 hartree
twoeener: 1758.38110763 hartree
kineticenergy: 2742.10062892 hartree
exchangeener: -74.791234189179 hartree
correlationener: -4.666944684978 hartree
xcener: -79.458178874157 hartree
energy: -12397.1019 -1600.2490 -1435.4216 -1435.4136 -1435.3724 -528.9901 -285.1916 -284.9022 -284.7539 -284.7384 -284.6984 -284.6721 -284.6564 -223.0384 -165.5563 -165.5476 -165.3937 -63.6833 -63.6747 -63.5477 -63.5078 -63.4689 -28.8385 -26.5170 -23.6469 -23.2557 -22.4399 -19.7198 -19.0266 -18.0555 -16.2209 -14.5402 -14.3870 -13.7527 -13.5923 -13.4200 -12.9445 -12.4423 -11.7758 -11.3622 -11.0968 -10.6600 -8.5555 -8.4441 -8.3261 -7.4957 -0.2341 0.1019 1.3702 1.6398 2.9258 3.9426 4.4396 4.7162 5.1546 5.1822 5.6312 5.6675 6.4627 6.8343 8.0921 8.5401 8.6010 8.8603 10.7675 11.7996 11.9091 12.8468 13.0945 13.5990 13.6911 14.0465 14.8839 15.7182 15.8751 16.4514 16.5547 16.6722 16.8053 16.9032 17.2571 17.3464 18.0799 18.4667 18.8901 19.2185 20.8383 20.9653 22.6043 23.1295 23.6783 24.5664 25.4153 25.9188 26.3645 26.5088 27.2650 27.7467 28.0519 28.3803 28.4284 29.1017 29.3069 29.7609 30.8955 31.2294 31.6755 32.6604 33.3695 34.8952 35.1656 35.5657 35.7426 36.6890 39.5600 41.3330 41.7484 42.1930 42.7836 43.8346 47.1060 48.1288 49.6691 49.8425 51.3416 52.6458 53.0571 54.3241 55.2855 55.8372 56.7295 57.4701 58.2312 58.2688 58.9891 59.7323 59.7840 59.9860 60.2934 62.6147 62.7382 64.2853 64.3287 64.6214 68.5345 69.7412 71.3346 74.1309 74.3929 74.7212 75.6139 75.9261 76.9722 83.1090 88.8508 89.7405 93.2719 93.4707 95.8702 97.3811 360.0366 370.9551 371.2335 373.4647 384.1417 384.2712 395.7125 696.9298 electronvolt
chargesum: -0.0000000
charge: -0.834605 0.897613 -0.214613 -0.244641 -0.207828 -0.221891 -0.205926 -0.233450 -0.706698 0.260836 0.241793 0.276659 0.228718 0.227873 0.228509 0.230023 0.277626
charge: -0.485578 0.750818 -0.180972 -0.140256 -0.130060 -0.125686 -0.125941 -0.125237 -0.600755 0.147276 0.141693 0.154745 0.138436 0.139811 0.139874 0.140911 0.160923
qa: -0.8346 0.8976 -0.2146 -0.2446 -0.2078 -0.2219 -0.2059 -0.2334 -0.7067 0.2608 0.2418 0.2767 0.2287 0.2279 0.2285 0.2300 0.2776
va: 3.6694 3.3991 3.7263 3.7845 3.8301 3.8109 3.8044 3.7884 1.7992 0.8968 0.9011 0.8900 0.9098 0.9086 0.9086 0.9080 0.9049
dispersion: -0.010366530 hartree
energy: -2746.412611233509 hartree
dipole: -17.28974 16.80610 -0.48365 -10.49011 8.89877 -1.59134 -8.88121 8.93451 0.05330
magnitude: 1.66407 au
magnitude: 4.22972 debye
temp: 298.15 k
press: 1.00 atm
zeropoint: 0.13515009 hartree
thermalvibcorrection: 0.00604525 hartree
thermalrotcorrection: 0.00141627 hartree
thermaltrasncorrection: 0.00141627 hartree
thermaltotal: -2746.26858335 hartree
thermalcorr: 0.00887779 hartree
nonthermalcorr: 0.13515009 hartree
totalcorr: 0.14402788 hartree
thermalcorrenthalpy: 0.00094421 hartree
totalenthalpy: -2746.26763914 hartree
vibrat: 0.01027326 hartree
rotat: 0.01416117 hartree
transl: 0.01975850 hartree
total: 0.04419293 hartree
totalentropycorr: -0.04419293 hartree
gibbsenthalpy: -2746.31183208 hartree
gibbsminuselec: 0.10077916 hartree
