program: Orca
programVersion: 5.0.4
elementType: O Se C C C C C C C C C C C C H H H H H H H H H H
charge: 0
multiplicity: 1
keywords: SP DSD-BLYP D3BJ def2-QZVPP def2-QZVPP/C def2/J TightSCF
formula: C12H10OSe
InChI: InChI=1/C12H10OSe/c13-14(11-7-3-1-4-8-11)12-9-5-2-6-10-12/h1-10H
24 atoms
O  -0.017904 1.681369 -1.690536
Se 0.086201 0.091172 -1.341302
C  1.436428 -0.003428 0.043089
C  1.948356 -1.228123 0.443283
C  2.925873 -1.266434 1.426783
C  3.391104 -0.086007 1.988381
C  2.883082 1.134039 1.565217
C  1.902814 1.182547 0.584752
C  -1.409882 -0.208694 -0.146749
C  -1.699821 -1.479197 0.327036
C  -2.790854 -1.658145 1.163838
C  -3.586858 -0.57434 1.508056
C  -3.293446 0.688564 1.015335
C  -2.200603 0.878935 0.180986
H  1.602037 -2.153433 -0.002881
H  3.329173 -2.217665 1.747734
H  4.157156 -0.11706 2.75178
H  3.253412 2.053966 1.997979
H  1.506659 2.129444 0.239311
H  -1.088237 -2.332094 0.055725
H  -3.021965 -2.644849 1.542776
H  -4.440073 -0.716945 2.157883
H  -3.918124 1.531473 1.280114
H  -1.964401 1.859439 -0.213582
totalener: -2937.73682354 hartree
nucrepener: 1196.05248720 hartree
electener: -4133.78931074 hartree
oneelecener: -6449.39033665 hartree
twoeener: 2315.60102591 hartree
kineticenergy: 2934.71470003 hartree
exchangeener: -49.563585913006 hartree
correlationener: -2.540316923478 hartree
xcener: -52.103902836484 hartree
chargesum: -0.0000000
charge: -0.733543 0.650985 -0.005465 -0.079774 -0.090429 -0.102928 -0.098881 -0.077843 -0.008423 -0.075021 -0.092415 -0.102666 -0.094643 -0.083801 0.069619 0.096575 0.095452 0.102659 0.134092 0.062189 0.096627 0.093208 0.099803 0.144624
charge: -0.353145 0.940437 -0.285895 0.020931 0.067817 0.073159 0.073719 0.046728 -0.284224 0.023049 0.067727 0.072474 0.072914 0.044196 -0.062319 -0.058926 -0.057661 -0.057437 -0.053074 -0.061498 -0.058951 -0.057927 -0.057672 -0.054423
qa: -0.7335 0.6510 -0.0055 -0.0798 -0.0904 -0.1029 -0.0989 -0.0778 -0.0084 -0.0750 -0.0924 -0.1027 -0.0946 -0.0838 0.0696 0.0966 0.0955 0.1027 0.1341 0.0622 0.0966 0.0932 0.0998 0.1446
va: 1.6798 3.4630 3.6248 3.7354 3.8063 3.8433 3.7929 3.7270 3.6157 3.7503 3.8145 3.8491 3.7947 3.7203 0.9975 0.9843 0.9852 0.9839 0.9947 0.9983 0.9831 0.9860 0.9845 0.9888
total: -2939.127495223 hartree
dispersion: -0.023888595 hartree
energy: -2939.151383817712 hartree
dipole: -1.43528 1.46868 0.03339 -3.35957 2.06100 -1.29857 24.61584 -23.34470 1.27114
magnitude: 1.81747 au
magnitude: 4.61964 debye
