program: Orca
programVersion: 5.0.4
elementType: Se F H
charge: 2
multiplicity: 1
keywords: SP DSD-BLYP D3BJ def2-QZVPP def2-QZVPP/C def2/J TightSCF
formula: HFSe
InChI: InChI=1/FHSe/c1-2/h2H
3 atoms
Se -0.236996 0.200469 0.0000
F  1.052752 -0.784869 0.0000
H  -1.277261 -0.910561 0.0000
totalener: -2499.99972471 hartree
nucrepener: 113.62912261 hartree
electener: -2613.62884732 hartree
oneelecener: -3678.17668804 hartree
twoeener: 1064.54784072 hartree
kineticenergy: 2498.12179699 hartree
exchangeener: -29.590918441464 hartree
correlationener: -1.055939890743 hartree
xcener: -30.646858332207 hartree
energy: -12490.2961 -1645.4381 -1476.0752 -1476.0274 -1475.9472 -716.8464 -253.1257 -193.7533 -193.4948 -193.2843 -88.5080 -88.4317 -88.1835 -87.9784 -87.9226 -56.9768 -40.8902 -33.8874 -33.0663 -32.5965 -29.0480 -20.2119 -15.2132 -12.5389 -8.2048 -7.0176 -6.5076 -6.2565 -5.5847 -5.1611 -4.6054 -3.1685 -2.5096 0.0252 1.3054 1.3488 2.2577 4.0236 5.1200 8.1233 9.2274 10.4936 11.0674 12.0141 13.1494 13.3941 14.5835 14.8026 14.8711 17.7562 19.1446 20.1198 20.4186 21.5864 21.7799 23.8079 27.0644 28.6331 30.3376 34.4134 35.6319 35.9556 37.5379 38.1232 38.4361 41.1854 41.4595 44.2776 45.1987 46.9160 48.2441 49.6740 50.0872 50.1547 52.4503 52.7384 53.7463 55.4069 56.9141 57.9931 58.3775 60.3633 64.5291 67.9955 68.1472 69.9134 71.9976 74.3564 75.4030 77.9981 86.4062 90.3066 94.3732 98.2363 103.9131 104.0937 104.5917 107.6348 108.1804 109.9210 111.1531 111.3975 118.3689 123.1974 124.3508 129.1831 130.3521 139.9113 143.6965 143.8211 146.8114 147.0518 151.4418 152.4110 154.6056 157.9501 162.6295 163.0189 163.8660 165.1957 166.9193 182.3831 183.4787 195.9227 197.6431 204.7469 206.2536 211.6812 216.2377 217.6836 218.5472 219.9532 220.4532 224.6834 227.6476 229.3549 239.3616 257.0542 302.0876 302.1641 302.5578 302.5707 302.8697 303.2193 305.6200 306.7764 308.0924 340.0155 349.2738 352.4067 390.0649 390.1723 392.7102 393.4573 396.9283 400.7431 401.8814 424.6731 425.3127 427.1256 433.2556 434.8620 444.6969 671.9218 830.4509 831.1983 831.6040 831.9681 832.8043 838.2798 840.2821 1480.6834 2219.5295 7604.0124 7795.6721 43688.8060 electronvolt
chargesum: 2.0000000
charge: 1.704575 -0.026733 0.322157
charge: 1.782847 0.238950 -0.021797
qa: 1.7046 -0.0267 0.3222
va: 2.3419 1.4797 0.8951
total: -2500.387194263 hartree
dispersion: -0.000876454 hartree
energy: -2500.388070717479 hartree
dipole: 0.26431 -1.58536 -1.32106 -2.18933 2.24600 0.05666 0.00000 -0.00000 -0.00000
magnitude: 1.32227 au
magnitude: 3.36094 debye
