program: Orca
programVersion: 5.0.4
elementType: F Se F F F
charge: 0
multiplicity: 1
keywords: Opt RIJCOSX PBEh-3c
formula: F4Se
InChI: InChI=1/F4Se/c1-5(2,3)4
5 atoms
F  0.496484 0.971989 0.920083
Se -0.491318 -0.078714 0.026475
F  -0.610248 1.204868 -1.178862
F  -0.071449 -1.31336 1.212554
F  0.676531 -0.784784 -0.980249
totalener: -2799.04990288 hartree
nucrepener: 476.29587378 hartree
electener: -3275.34577666 hartree
oneelecener: -4846.44130967 hartree
twoeener: 1571.09553301 hartree
kineticenergy: 2794.94001661 hartree
exchangeener: -70.975797640086 hartree
correlationener: -3.866570851871 hartree
xcener: -74.842368491957 hartree
dispersion: -0.001318230 hartree
dispersion: -0.001317507 hartree
dispersion: -0.001317005 hartree
dispersion: -0.001316961 hartree
dispersion: -0.001316942 hartree
dispersion: -0.001316979 hartree
energy: -12401.6991 -1604.4851 -1439.6754 -1439.6536 -1439.5952 -684.6179 -684.6120 -682.8212 -682.8126 -227.2028 -169.7022 -169.6634 -169.5103 -67.8689 -67.7712 -67.7114 -67.6059 -67.5945 -38.4116 -37.0494 -35.5444 -35.1903 -23.1906 -17.8302 -17.5290 -17.0430 -15.5125 -14.9401 -14.7841 -14.6328 -13.4156 -13.3116 -13.0659 -12.9142 -10.9961 -1.7143 0.3086 2.0939 7.1971 11.2648 11.3983 12.0800 12.8301 13.8467 14.2637 18.6406 21.5359 28.3455 28.4461 28.8573 29.2794 31.6667 31.7813 31.9750 32.0333 32.7188 33.1794 33.2105 33.8773 34.0026 34.0811 34.1981 34.4132 34.4395 34.4490 34.7836 35.3064 36.5542 38.4178 40.0329 42.6468 42.7289 42.8693 43.6465 44.1301 46.0746 47.2431 50.7179 52.1688 68.8963 72.7041 73.6271 78.6805 88.9680 89.3254 92.5590 92.7765 95.9201 886.6813 887.9426 889.1057 893.5665 electronvolt
chargesum: 0.0000000
charge: -0.412508 1.769318 -0.472341 -0.471897 -0.412571
charge: -0.275350 1.279666 -0.364935 -0.364153 -0.275227
qa: -0.4125 1.7693 -0.4723 -0.4719 -0.4126
va: 0.9583 3.3558 0.9045 0.9048 0.9581
dispersion: -0.001317022 hartree
energy: -2799.023755437092 hartree
dipole: 1.93862 -2.60695 -0.66833 0.31059 -0.41946 -0.10887 -0.10446 0.14242 0.03796
magnitude: 0.67820 au
magnitude: 1.72385 debye
