program: Orca
programVersion: 5.0.4
elementType: F Se F O
charge: 0
multiplicity: 1
keywords: SP DSD-BLYP D3BJ def2-QZVPP def2-QZVPP/C def2/J TightSCF
formula: F2OSe
InChI: InChI=1/F2OSe/c1-4(2)3
4 atoms
F  -1.102595 -1.013443 -0.442411
Se -0.015233 0.100488 0.305772
F  1.356409 -0.629972 -0.449421
O  -0.226211 1.455537 -0.450042
totalener: -2675.21604497 hartree
nucrepener: 325.71538622 hartree
electener: -3000.93143120 hartree
oneelecener: -4371.40681251 hartree
twoeener: 1370.47538131 hartree
kineticenergy: 2672.99983048 hartree
exchangeener: -35.397405912963 hartree
correlationener: -1.427093288326 hartree
xcener: -36.824499201289 hartree
energy: -12473.3257 -1628.4526 -1459.0672 -1459.0619 -1458.9991 -699.8967 -699.8868 -545.6193 -236.2977 -176.8183 -176.7630 -176.5805 -71.6381 -71.5655 -71.3693 -71.3532 -71.2989 -40.8801 -39.8510 -34.2135 -23.5099 -18.7846 -18.1076 -17.6094 -16.5788 -16.2983 -15.9690 -13.8751 -12.8802 -11.9640 -0.1094 1.0249 2.5603 4.3546 5.5378 5.7861 6.8006 8.8846 9.1330 9.4134 9.6792 9.7305 11.4367 12.5651 12.6004 12.8678 13.3735 14.1627 14.6814 15.8405 18.1006 21.1792 22.1732 24.8753 25.3600 26.0982 26.4055 26.8220 27.8466 30.5212 30.8821 31.3001 33.5769 33.7121 34.4740 35.5811 37.3364 38.4147 38.6041 38.8510 39.4971 41.0101 41.8016 42.1656 42.3660 44.8551 45.9541 46.7740 48.7162 48.9494 49.5022 49.5956 50.1473 50.6322 50.8761 51.6290 52.0566 53.9092 56.7184 61.3128 62.5398 63.9594 64.5592 65.1617 65.4987 65.6814 66.4973 66.6090 69.1274 73.1628 73.8430 77.3130 78.4970 79.5604 81.9064 82.9790 85.0094 85.8185 85.9285 86.9860 92.4692 92.7818 96.6376 102.1879 102.3013 102.9005 104.8893 106.7463 109.8841 111.2783 112.3011 113.1427 114.4309 116.1799 117.8463 118.4433 118.8334 118.9343 119.7661 120.8479 121.1062 122.8699 123.8396 124.1099 126.1084 128.1554 131.1513 134.6989 135.1934 136.0681 138.1594 138.4951 139.8915 140.5154 141.3521 143.0747 144.9996 146.5764 147.4676 148.0560 148.3034 152.0325 153.6511 157.0536 158.7863 160.0593 160.8122 163.8981 177.6635 179.8146 180.1433 180.9959 181.5165 186.4450 199.3416 201.9069 202.1059 233.5470 235.4386 235.5256 236.0052 244.0328 245.3443 248.6832 248.6874 248.8605 249.0069 250.6980 252.9296 254.7349 261.7090 263.0025 263.4757 307.1291 307.2056 311.5948 312.2825 317.7371 317.8653 317.9152 318.1088 318.2982 318.4011 318.4639 318.4813 318.4966 318.5122 318.7623 319.1530 319.9299 320.1329 320.6411 321.0874 323.7106 324.6074 325.1423 327.2705 327.3363 335.8575 337.5378 343.7055 344.1410 354.0383 365.5645 367.9291 375.5346 386.6535 406.0372 406.1086 406.2599 406.4712 407.2968 407.7545 409.0594 410.1337 412.3747 412.6283 414.5463 414.8745 415.1330 415.5440 434.7287 436.5430 440.0848 441.4171 442.2558 442.7175 447.9996 449.5160 450.1454 452.7895 460.4936 460.5170 691.3919 847.7537 848.4180 850.2985 851.0447 852.8197 854.2681 859.1426 1320.9899 1492.6129 1493.5011 2238.8763 6928.8300 7623.4352 7806.6135 7807.5588 43710.3299 electronvolt
chargesum: 0.0000000
charge: -0.406165 1.362221 -0.406441 -0.549616
charge: -0.104319 0.477276 -0.104906 -0.268050
qa: -0.4062 1.3622 -0.4064 -0.5496
va: 0.8818 3.6351 0.8820 2.0125
total: -2675.888228190 hartree
dispersion: -0.001940067 hartree
energy: -2675.890168256103 hartree
dipole: -0.08180 0.12881 0.04701 0.51045 -0.81315 -0.30269 -2.32589 3.47851 1.15262
magnitude: 1.19263 au
magnitude: 3.03143 debye
