program: Orca
programVersion: 5.0.4
elementType: F Se F
charge: 2
multiplicity: 1
keywords: Opt RIJCOSX PBEh-3c
formula: F2Se
InChI: InChI=1/F2Se/c1-3-2
3 atoms
F  -1.23165 -0.346916 0.0000
Se -0.000482 0.692099 0.0000
F  1.232133 -0.345183 0.0000
totalener: -2598.64299604 hartree
nucrepener: 218.42770140 hartree
electener: -2817.07069743 hartree
oneelecener: -4018.81876273 hartree
twoeener: 1201.74806529 hartree
kineticenergy: 2595.69488031 hartree
exchangeener: -59.263580504091 hartree
correlationener: -2.906981945607 hartree
xcener: -62.170562449697 hartree
dispersion: -0.000511315 hartree
energy: -12419.3632 -1622.2127 -1457.3796 -1457.3758 -1457.3206 -701.9479 -701.9477 -244.8649 -187.3886 -187.2884 -187.1487 -85.4858 -85.4301 -85.3376 -85.3035 -85.2007 -55.3533 -53.9727 -39.4127 -33.9361 -33.0083 -32.5886 -30.9812 -30.7698 -30.1631 -21.7264 -17.1216 -16.1359 -7.6589 -4.3816 -3.7908 -3.4280 -1.7639 -1.3781 -1.3718 -0.5446 4.2791 16.3623 17.0857 17.9295 18.2077 18.2990 19.0666 19.0784 19.2298 19.3794 19.4448 23.6523 24.9201 25.4065 25.6205 28.4038 31.2798 55.4706 55.6437 65.7781 65.8591 68.9090 71.4070 77.8930 871.4532 871.7295 electronvolt
chargesum: 2.0000000
charge: -0.145918 2.291834 -0.145916
charge: 0.004156 1.991684 0.004160
qa: -0.1459 2.2918 -0.1459
va: 1.3612 2.5603 1.3612
dispersion: -0.000511319 hartree
energy: -2598.635803331541 hartree
dipole: 0.00151 -0.00215 -0.00064 -2.17082 3.10884 0.93802 0.00000 -0.00000 -0.00000
magnitude: 0.93802 au
magnitude: 2.38426 debye
