program: Orca
programVersion: 5.0.4
elementType: F Se F F C H H H
charge: 0
multiplicity: 1
keywords: Freq RIJCOSX PBEh-3c
frequency: 0.00 0.00 0.00 0.00 0.00 0.00 25.76 179.42 270.02 330.78 339.10 379.93 588.00 632.50 655.25 757.60 969.91 1021.53 1395.46 1502.82 1515.68 3140.13 3247.72 3276.69
frequency: 25.76 179.42 270.02 330.78 339.10 379.93 588.00 632.50 655.25 757.60 969.91 1021.53 1395.46 1502.82 1515.68 3140.13 3247.72 3276.69
formula: CH3F3Se
InChI: InChI=1/CH3F3Se/c1-5(2,3)4/h1H3
8 atoms
F  1.148241 1.69292 -0.145111
Se 0.952117 -0.046723 -0.552211
F  1.754135 -0.347426 0.931052
F  0.701114 -1.825362 -0.600732
C  -0.89114 0.112031 0.005438
H  -0.925099 -0.010949 1.088759
H  -1.264045 1.097664 -0.25946
H  -1.475324 -0.672356 -0.467635
totalener: -2739.22562203 hartree
nucrepener: 456.21517805 hartree
electener: -3195.44080009 hartree
oneelecener: -4722.15485288 hartree
twoeener: 1526.71405279 hartree
kineticenergy: 2735.40884462 hartree
exchangeener: -68.800900304680 hartree
correlationener: -3.809440926531 hartree
xcener: -72.610341231211 hartree
energy: -12399.7274 -1602.6498 -1437.8545 -1437.8116 -1437.7468 -683.5850 -681.7905 -681.7713 -285.4776 -225.3761 -167.9036 -167.8775 -167.6500 -66.0977 -66.0041 -65.8013 -65.7999 -65.7362 -36.6917 -34.3973 -34.2908 -24.1574 -20.8719 -16.1944 -16.0395 -15.3484 -14.4684 -13.8227 -13.7386 -13.1417 -12.3792 -12.2822 -11.9491 -11.4796 -9.8282 -0.8114 1.6047 2.1860 4.0123 4.8703 4.9244 9.2308 11.8055 12.1749 12.5754 12.6893 13.0750 14.1747 14.9922 16.3426 16.7713 21.8886 22.9047 26.5121 26.5697 27.7516 29.6785 31.0425 31.3575 31.8495 33.4595 33.5315 33.9070 34.6290 34.6929 34.8249 35.0181 35.1388 35.4528 35.5910 35.8603 36.7529 37.6961 38.9393 41.7635 42.5215 44.7606 44.9217 46.9258 47.0423 47.6480 50.4381 52.0397 57.8086 61.7847 61.9740 68.9990 73.3947 78.8780 88.7822 90.4263 92.6997 94.0798 96.8711 372.8104 886.2303 888.7188 894.2613 electronvolt
chargesum: -0.0000000
charge: -0.502776 1.428872 -0.429572 -0.503388 -0.835599 0.293838 0.273881 0.274742
charge: -0.406599 1.090365 -0.305170 -0.407093 -0.461104 0.172238 0.158523 0.158840
qa: -0.5028 1.4289 -0.4296 -0.5034 -0.8356 0.2938 0.2739 0.2747
va: 0.8463 3.3234 0.9234 0.8451 3.7024 0.8851 0.8917 0.8916
dispersion: -0.002734869 hartree
energy: -2739.198478417801 hartree
dipole: -7.79574 6.85576 -0.93998 0.56421 -0.39789 0.16632 3.15591 -3.49471 -0.33880
magnitude: 1.01292 au
magnitude: 2.57464 debye
temp: 298.15 k
press: 1.00 atm
zeropoint: 0.04608350 hartree
thermalvibcorrection: 0.00365102 hartree
thermalrotcorrection: 0.00141627 hartree
thermaltrasncorrection: 0.00141627 hartree
thermaltotal: -2739.14591136 hartree
thermalcorr: 0.00648356 hartree
nonthermalcorr: 0.04608350 hartree
totalcorr: 0.05256706 hartree
thermalcorrenthalpy: 0.00094421 hartree
totalenthalpy: -2739.14496715 hartree
vibrat: 0.00635395 hartree
rotat: 0.01258164 hartree
transl: 0.01945480 hartree
total: 0.03839039 hartree
totalentropycorr: -0.03839039 hartree
gibbsenthalpy: -2739.18335754 hartree
gibbsminuselec: 0.01512088 hartree
