program: Orca
programVersion: 5.0.4
elementType: F Se F F C H H H
charge: 0
multiplicity: 1
keywords: SP DSD-BLYP D3BJ def2-QZVPP def2-QZVPP/C def2/J TightSCF
formula: CH3F3Se
InChI: InChI=1/CH3F3Se/c1-5(2,3)4/h1H3
8 atoms
F  0.292269 1.766056 0.117516
Se 0.096145 0.026413 -0.289584
F  0.898164 -0.27429 1.19368
F  -0.154857 -1.752227 -0.338105
C  -1.747112 0.185166 0.268065
H  -1.781071 0.062187 1.351386
H  -2.120016 1.1708 0.003167
H  -2.331296 -0.59922 -0.205007
totalener: -2739.61221854 hartree
nucrepener: 456.21517743 hartree
electener: -3195.82739597 hartree
oneelecener: -4722.18030119 hartree
twoeener: 1526.35290522 hartree
kineticenergy: 2737.29047434 hartree
exchangeener: -37.910028923836 hartree
correlationener: -1.606630979709 hartree
xcener: -39.516659903545 hartree
chargesum: 0.0000000
charge: -0.517108 1.303570 -0.395659 -0.517581 -0.242900 0.128108 0.120339 0.121230
charge: -0.212450 0.628115 -0.047143 -0.212114 0.095882 -0.076662 -0.087717 -0.087912
qa: -0.5171 1.3036 -0.3957 -0.5176 -0.2429 0.1281 0.1203 0.1212
va: 0.7224 3.2970 0.8937 0.7210 3.8354 0.9899 0.9992 0.9988
total: -2740.390149336 hartree
dispersion: -0.004362181 hartree
energy: -2740.394511517439 hartree
dipole: -7.79574 6.72700 -1.06874 0.56420 -0.37366 0.19055 3.15591 -3.56001 -0.40410
magnitude: 1.15837 au
magnitude: 2.94433 debye
