program: Orca
programVersion: 5.0.4
elementType: F Si F F C C C C C C H H H H H
charge: 0
multiplicity: 1
keywords: Freq RIJCOSX PBEh-3c
frequency: 0.00 0.00 0.00 0.00 0.00 0.00 17.62 100.56 124.22 230.75 254.57 269.33 331.27 375.37 411.77 470.29 497.54 644.86 717.90 734.86 782.03 880.50 903.60 978.49 994.69 1005.86 1035.44 1043.68 1063.91 1087.99 1143.33 1193.96 1220.57 1258.24 1364.20 1411.44 1516.78 1580.07 1693.23 1719.34 3259.05 3264.81 3272.79 3283.69 3291.41
frequency: 17.62 100.56 124.22 230.75 254.57 269.33 331.27 375.37 411.77 470.29 497.54 644.86 717.90 734.86 782.03 880.50 903.60 978.49 994.69 1005.86 1035.44 1043.68 1063.91 1087.99 1143.33 1193.96 1220.57 1258.24 1364.20 1411.44 1516.78 1580.07 1693.23 1719.34 3259.05 3264.81 3272.79 3283.69 3291.41
formula: C6H5F3Si
InChI: InChI=1/C6H5F3Si/c7-10(8,9)6-4-2-1-3-5-6/h1-5H
15 atoms
F  -3.119744 -0.970971 -0.871536
Si -2.41875 0.181669 -0.015361
F  -3.000616 0.029236 1.465489
F  -2.890561 1.588251 -0.610484
C  -0.586022 0.055034 -0.020912
C  0.039865 -0.916166 0.763978
C  1.420365 -1.028101 0.783362
C  2.195624 -0.168663 0.018444
C  1.588788 0.798899 -0.768164
C  0.206589 0.910318 -0.788829
H  -0.547909 -1.591368 1.373809
H  1.891366 -1.782661 1.399064
H  3.274505 -0.251638 0.039054
H  2.194157 1.470398 -1.362643
H  -0.247657 1.675864 -1.40527
totalener: -819.46424940 hartree
nucrepener: 609.97449743 hartree
electener: -1429.43874682 hartree
oneelecener: -2343.52313395 hartree
twoeener: 914.08438713 hartree
kineticenergy: 815.05173966 hartree
exchangeener: -46.755534954296 hartree
correlationener: -3.769972190248 hartree
xcener: -50.525507144544 hartree
energy: -1819.7036 -683.1931 -683.0890 -683.0364 -285.0036 -284.9977 -284.9034 -284.8231 -284.7939 -284.7920 -153.1028 -106.6919 -106.6838 -106.5846 -36.4623 -35.7693 -35.6546 -26.5860 -23.3920 -23.3735 -19.2161 -19.1123 -17.7545 -16.5702 -15.8173 -15.7201 -15.0701 -14.6019 -14.4725 -14.2691 -14.2465 -13.7678 -13.6176 -13.5072 -13.2026 -12.9054 -12.0928 -11.3841 -10.7559 -8.7087 -8.5520 -0.5624 -0.0037 2.3481 2.8926 3.7208 3.8659 4.9950 5.2371 5.3587 5.6022 6.5336 6.6758 7.2607 8.4069 8.4766 8.6018 9.2090 11.5048 12.1096 12.2752 12.6537 13.9308 14.7318 14.9324 15.4090 16.0602 16.3654 16.5344 16.6016 16.6776 16.7493 17.3170 18.1457 18.5856 19.8095 20.4836 20.9952 21.3695 22.6841 22.9762 23.4465 25.3679 25.7057 25.8661 26.2466 27.3560 28.1241 28.1952 29.0725 29.2294 29.3165 30.8754 31.7389 32.2082 32.4128 32.6567 33.4753 33.6585 33.8184 33.9541 34.0591 34.1114 34.4000 34.7871 34.8959 35.2636 36.3086 36.9474 37.1607 37.3792 38.5093 38.9190 39.5151 40.0465 40.2704 41.2593 41.5682 42.0971 42.1598 43.5444 45.9707 46.9483 47.6887 48.0876 49.2009 49.9410 50.5315 51.5577 51.8644 55.0198 55.7719 57.8500 58.9950 59.4608 59.5517 59.9791 60.4848 64.0254 64.2042 64.9311 69.6446 71.1931 73.8825 74.5009 74.9778 75.2016 75.8632 76.8082 80.1639 80.8529 81.7040 83.6148 93.4166 360.1146 370.9396 371.3835 383.5850 384.0791 395.4619 891.6152 892.7978 893.8398 electronvolt
chargesum: -0.0000000
charge: -0.449288 1.529084 -0.453216 -0.453158 -0.183104 -0.266854 -0.204993 -0.223349 -0.202636 -0.264508 0.236370 0.230834 0.232781 0.230786 0.241253
charge: -0.222118 0.748773 -0.222442 -0.221340 -0.203316 -0.109291 -0.131105 -0.112391 -0.131479 -0.110396 0.144456 0.141661 0.141386 0.141551 0.146050
qa: -0.4493 1.5291 -0.4532 -0.4532 -0.1831 -0.2669 -0.2050 -0.2233 -0.2026 -0.2645 0.2364 0.2308 0.2328 0.2308 0.2413
va: 0.9811 3.7789 0.9754 0.9780 3.6830 3.8425 3.8095 3.8150 3.8037 3.8338 0.9060 0.9074 0.9068 0.9074 0.9064
dispersion: -0.008502359 hartree
energy: -819.447104444975 hartree
dipole: 16.63550 -15.41705 1.21845 -1.20449 1.13748 -0.06701 0.06717 -0.07101 -0.00384
magnitude: 1.22029 au
magnitude: 3.10174 debye
temp: 298.15 k
press: 1.00 atm
zeropoint: 0.10349712 hartree
thermalvibcorrection: 0.00613318 hartree
thermalrotcorrection: 0.00141627 hartree
thermaltrasncorrection: 0.00141627 hartree
thermaltotal: -819.33464160 hartree
thermalcorr: 0.00896573 hartree
nonthermalcorr: 0.10349712 hartree
totalcorr: 0.11246284 hartree
thermalcorrenthalpy: 0.00094421 hartree
totalenthalpy: -819.33369739 hartree
vibrat: 0.01080592 hartree
rotat: 0.01427708 hartree
transl: 0.01955611 hartree
total: 0.04463912 hartree
totalentropycorr: -0.04463912 hartree
gibbsenthalpy: -819.37833651 hartree
gibbsminuselec: 0.06876793 hartree
